All pastes #1181941 Raw Edit

Unnamed

public text v1 · immutable
#1181941 ·published 2008-08-22 21:23 UTC
rendered paste body
kschmidt@kschmidt-laptop:~$ cd /media/ACER/linux/madwifi-0.9.4
kschmidt@kschmidt-laptop:/media/ACER/linux/madwifi-0.9.4$ make
Checking requirements... ok.
Checking kernel configuration... ok.
make -C /lib/modules/2.6.24-19-generic/build SUBDIRS=/media/ACER/linux/madwifi-0.9.4 modules
make[1]: Entering directory `/usr/src/linux-headers-2.6.24-19-generic'
  HOSTCC  /media/ACER/linux/madwifi-0.9.4/ath_hal/uudecode
/media/ACER/linux/madwifi-0.9.4/ath_hal/uudecode.c:26:19: error: stdio.h: No such file or directory
/media/ACER/linux/madwifi-0.9.4/ath_hal/uudecode.c:27:19: error: errno.h: No such file or directory
/media/ACER/linux/madwifi-0.9.4/ath_hal/uudecode.c:28:20: error: getopt.h: No such file or directory
/media/ACER/linux/madwifi-0.9.4/ath_hal/uudecode.c:29:20: error: string.h: No such file or directory
/media/ACER/linux/madwifi-0.9.4/ath_hal/uudecode.c:30:20: error: stdlib.h: No such file or directory
/media/ACER/linux/madwifi-0.9.4/ath_hal/uudecode.c:32:23: error: sys/fcntl.h: No such file or directory
/media/ACER/linux/madwifi-0.9.4/ath_hal/uudecode.c:33:22: error: sys/stat.h: No such file or directory
/media/ACER/linux/madwifi-0.9.4/ath_hal/uudecode.c: In function 'uudecode_usage':
/media/ACER/linux/madwifi-0.9.4/ath_hal/uudecode.c:37: warning: implicit declaration of function 'printf'
/media/ACER/linux/madwifi-0.9.4/ath_hal/uudecode.c:37: warning: incompatible implicit declaration of built-in function 'printf'
/media/ACER/linux/madwifi-0.9.4/ath_hal/uudecode.c: At top level:
/media/ACER/linux/madwifi-0.9.4/ath_hal/uudecode.c:40: error: expected ')' before '*' token
/media/ACER/linux/madwifi-0.9.4/ath_hal/uudecode.c:70: error: expected ')' before '*' token
/media/ACER/linux/madwifi-0.9.4/ath_hal/uudecode.c: In function 'main':
/media/ACER/linux/madwifi-0.9.4/ath_hal/uudecode.c:121: error: 'FILE' undeclared (first use in this function)
/media/ACER/linux/madwifi-0.9.4/ath_hal/uudecode.c:121: error: (Each undeclared identifier is reported only once
/media/ACER/linux/madwifi-0.9.4/ath_hal/uudecode.c:121: error: for each function it appears in.)
/media/ACER/linux/madwifi-0.9.4/ath_hal/uudecode.c:121: error: 'src_stream' undeclared (first use in this function)
/media/ACER/linux/madwifi-0.9.4/ath_hal/uudecode.c:122: error: 'dst_stream' undeclared (first use in this function)
/media/ACER/linux/madwifi-0.9.4/ath_hal/uudecode.c:122: error: 'NULL' undeclared (first use in this function)
/media/ACER/linux/madwifi-0.9.4/ath_hal/uudecode.c:130: warning: implicit declaration of function 'getopt'
/media/ACER/linux/madwifi-0.9.4/ath_hal/uudecode.c:134: error: 'optarg' undeclared (first use in this function)
/media/ACER/linux/madwifi-0.9.4/ath_hal/uudecode.c:138: warning: implicit declaration of function 'exit'
/media/ACER/linux/madwifi-0.9.4/ath_hal/uudecode.c:138: warning: incompatible implicit declaration of built-in function 'exit'
/media/ACER/linux/madwifi-0.9.4/ath_hal/uudecode.c:141: error: 'optind' undeclared (first use in this function)
/media/ACER/linux/madwifi-0.9.4/ath_hal/uudecode.c:142: error: 'stdin' undeclared (first use in this function)
/media/ACER/linux/madwifi-0.9.4/ath_hal/uudecode.c:144: warning: implicit declaration of function 'fopen'
/media/ACER/linux/madwifi-0.9.4/ath_hal/uudecode.c:146: warning: implicit declaration of function 'fprintf'
/media/ACER/linux/madwifi-0.9.4/ath_hal/uudecode.c:146: warning: incompatible implicit declaration of built-in function 'fprintf'
/media/ACER/linux/madwifi-0.9.4/ath_hal/uudecode.c:146: error: 'stderr' undeclared (first use in this function)
/media/ACER/linux/madwifi-0.9.4/ath_hal/uudecode.c:147: warning: implicit declaration of function 'strerror'
/media/ACER/linux/madwifi-0.9.4/ath_hal/uudecode.c:147: error: 'errno' undeclared (first use in this function)
/media/ACER/linux/madwifi-0.9.4/ath_hal/uudecode.c:147: warning: format '%s' expects type 'char *', but argument 4 has type 'int'
/media/ACER/linux/madwifi-0.9.4/ath_hal/uudecode.c:148: warning: incompatible implicit declaration of built-in function 'exit'
/media/ACER/linux/madwifi-0.9.4/ath_hal/uudecode.c:152: warning: incompatible implicit declaration of built-in function 'exit'
/media/ACER/linux/madwifi-0.9.4/ath_hal/uudecode.c:156: warning: implicit declaration of function 'get_line_from_file'
/media/ACER/linux/madwifi-0.9.4/ath_hal/uudecode.c:156: warning: assignment makes pointer from integer without a cast
/media/ACER/linux/madwifi-0.9.4/ath_hal/uudecode.c:157: warning: implicit declaration of function 'strncmp'
/media/ACER/linux/madwifi-0.9.4/ath_hal/uudecode.c:164: warning: incompatible implicit declaration of built-in function 'fprintf'
/media/ACER/linux/madwifi-0.9.4/ath_hal/uudecode.c:165: warning: incompatible implicit declaration of built-in function 'exit'
/media/ACER/linux/madwifi-0.9.4/ath_hal/uudecode.c:168: warning: implicit declaration of function 'strtoul'
/media/ACER/linux/madwifi-0.9.4/ath_hal/uudecode.c:170: warning: implicit declaration of function 'strchr'
/media/ACER/linux/madwifi-0.9.4/ath_hal/uudecode.c:170: warning: incompatible implicit declaration of built-in function 'strchr'
/media/ACER/linux/madwifi-0.9.4/ath_hal/uudecode.c:172: warning: incompatible implicit declaration of built-in function 'fprintf'
/media/ACER/linux/madwifi-0.9.4/ath_hal/uudecode.c:173: warning: incompatible implicit declaration of built-in function 'exit'
/media/ACER/linux/madwifi-0.9.4/ath_hal/uudecode.c:178: warning: implicit declaration of function 'strcmp'
/media/ACER/linux/madwifi-0.9.4/ath_hal/uudecode.c:179: error: 'stdout' undeclared (first use in this function)
/media/ACER/linux/madwifi-0.9.4/ath_hal/uudecode.c:182: error: 'O_WRONLY' undeclared (first use in this function)
/media/ACER/linux/madwifi-0.9.4/ath_hal/uudecode.c:182: error: 'O_CREAT' undeclared (first use in this function)
/media/ACER/linux/madwifi-0.9.4/ath_hal/uudecode.c:182: error: 'O_TRUNC' undeclared (first use in this function)
/media/ACER/linux/madwifi-0.9.4/ath_hal/uudecode.c:186: error: 'O_EXCL' undeclared (first use in this function)
/media/ACER/linux/madwifi-0.9.4/ath_hal/uudecode.c:188: warning: implicit declaration of function 'open'
/media/ACER/linux/madwifi-0.9.4/ath_hal/uudecode.c:189: error: 'S_IRWXU' undeclared (first use in this function)
/media/ACER/linux/madwifi-0.9.4/ath_hal/uudecode.c:189: error: 'S_IRWXG' undeclared (first use in this function)
/media/ACER/linux/madwifi-0.9.4/ath_hal/uudecode.c:189: error: 'S_IRWXO' undeclared (first use in this function)
/media/ACER/linux/madwifi-0.9.4/ath_hal/uudecode.c:191: warning: implicit declaration of function 'fdopen'
/media/ACER/linux/madwifi-0.9.4/ath_hal/uudecode.c:193: warning: incompatible implicit declaration of built-in function 'fprintf'
/media/ACER/linux/madwifi-0.9.4/ath_hal/uudecode.c:194: warning: format '%s' expects type 'char *', but argument 4 has type 'int'
/media/ACER/linux/madwifi-0.9.4/ath_hal/uudecode.c:195: warning: incompatible implicit declaration of built-in function 'exit'
/media/ACER/linux/madwifi-0.9.4/ath_hal/uudecode.c:199: warning: implicit declaration of function 'read_stduu'
/media/ACER/linux/madwifi-0.9.4/ath_hal/uudecode.c:201: warning: implicit declaration of function 'fclose'
make[3]: *** [/media/ACER/linux/madwifi-0.9.4/ath_hal/uudecode] Error 1
make[2]: *** [/media/ACER/linux/madwifi-0.9.4/ath_hal] Error 2
make[1]: *** [_module_/media/ACER/linux/madwifi-0.9.4] Error 2
make[1]: Leaving directory `/usr/src/linux-headers-2.6.24-19-generic'
make: *** [modules] Error 2