rendered paste bodyg++ -c -pipe -fno-exceptions -fPIC -Wall -W -mcpu=i686 -O2 -D_REENTRANT -DDESIGNER -DQT_INTERNAL_XML -DQT_INTERNAL_WORKSPACE -DQT_INTERNAL_ICONVIEW -DQT_INTERNAL_TABLE -DQT_TABLET_SUPPORT -DQT_NO_DEBUG -DQT_THREAD_SUPPORT -DQT_SHARED -I/var/tmp/portage/qt-3.3.4-r3/work/qt-x11-free-3.3.4/mkspecs/linux-g++ -I. -I/usr/include/freetype2 -I../shared -I../uilib -I../../../include -I.moc/release-shared-mt/ -o ./dbconnectionimpl.o dbconnectionimpl.cpp
g++ -c -pipe -fno-exceptions -fPIC -Wall -W -mcpu=i686 -O2 -D_REENTRANT -DDESIGNER -DQT_INTERNAL_XML -DQT_INTERNAL_WORKSPACE -DQT_INTERNAL_ICONVIEW -DQT_INTERNAL_TABLE -DQT_TABLET_SUPPORT -DQT_NO_DEBUG -DQT_THREAD_SUPPORT -DQT_SHARED -I/var/tmp/portage/qt-3.3.4-r3/work/qt-x11-free-3.3.4/mkspecs/linux-g++ -I. -I/usr/include/freetype2 -I../shared -I../uilib -I../../../include -I.moc/release-shared-mt/ -o ./dbconnectionsimpl.o dbconnectionsimpl.cpp
g++ -c -pipe -fno-exceptions -fPIC -Wall -W -mcpu=i686 -O2 -D_REENTRANT -DDESIGNER -DQT_INTERNAL_XML -DQT_INTERNAL_WORKSPACE -DQT_INTERNAL_ICONVIEW -DQT_INTERNAL_TABLE -DQT_TABLET_SUPPORT -DQT_NO_DEBUG -DQT_THREAD_SUPPORT -DQT_SHARED -I/var/tmp/portage/qt-3.3.4-r3/work/qt-x11-free-3.3.4/mkspecs/linux-g++ -I. -I/usr/include/freetype2 -I../shared -I../uilib -I../../../include -I.moc/release-shared-mt/ -o ./tableeditorimpl.o tableeditorimpl.cpp
/var/tmp/portage/qt-3.3.4-r3/work/qt-x11-free-3.3.4/bin/uic -L /var/tmp/portage/qt-3.3.4-r3/work/qt-x11-free-3.3.4/plugins listboxeditor.ui -i listboxeditor.h -o listboxeditor.cpp
Inconsistency detected by ld.so: ../sysdeps/i386/dl-machine.h: 649: elf_machine_rel_relative: Assertion `((reloc->r_info) & 0xff) == 8' failed!
make[3]: *** [listboxeditor.cpp] Error 127
make[3]: Leaving directory `/var/tmp/portage/qt-3.3.4-r3/work/qt-x11-free-3.3.4/tools/designer/designer'
make[2]: *** [sub-designer] Error 2
make[2]: Leaving directory `/var/tmp/portage/qt-3.3.4-r3/work/qt-x11-free-3.3.4/tools/designer'
make[1]: *** [sub-designer] Error 2
make[1]: Leaving directory `/var/tmp/portage/qt-3.3.4-r3/work/qt-x11-free-3.3.4/tools'
make: *** [sub-tools] Error 2
!!! ERROR: x11-libs/qt-3.3.4-r3 failed.
!!! Function src_compile, Line 150, Exitcode 2
!!! (no error message)
--------------------
genlop
genlop binutils
* sys-devel/binutils
Sun Sep 19 23:37:58 2004 >>> sys-devel/binutils-2.14.90.0.8-r1
Fri Sep 24 12:11:00 2004 >>> sys-devel/binutils-2.15.90.0.1.1-r3
Sun Oct 17 12:40:19 2004 >>> sys-devel/binutils-2.15.92.0.2-r1
Wed Nov 10 00:02:05 2004 >>> sys-devel/binutils-2.14.90.0.8-r1
Wed Nov 10 07:47:51 2004 >>> sys-devel/binutils-2.14.90.0.8-r1
Mon Nov 22 20:19:42 2004 >>> sys-devel/binutils-2.15.90.0.1.1-r3
Sat Nov 27 22:54:29 2004 >>> sys-devel/binutils-2.15.90.0.1.1-r3
Sun Nov 28 00:00:21 2004 >>> sys-devel/binutils-2.15.90.0.1.1-r3
Fri Dec 17 03:35:27 2004 >>> sys-devel/binutils-2.15.90.0.1.1-r3
Sat Dec 18 05:11:02 2004 >>> sys-devel/binutils-2.15.90.0.1.1-r3
Tue Jan 11 22:38:21 2005 >>> sys-devel/binutils-2.15.92.0.2-r1
Sat Jan 15 02:18:53 2005 >>> sys-devel/binutils-2.15.92.0.2-r1
Tue Apr 5 20:59:29 2005 >>> sys-devel/binutils-2.15.92.0.2-r7
Mon May 9 22:23:47 2005 >>> sys-devel/binutils-2.15.92.0.2-r7
Wed May 11 22:45:16 2005 >>> sys-devel/binutils-2.15.92.0.2-r7
Sat May 14 13:17:49 2005 >>> sys-devel/binutils-2.15.92.0.2-r7
Sat May 14 22:59:27 2005 >>> sys-devel/binutils-2.15.92.0.2-r7
Sun May 15 11:50:55 2005 >>> sys-devel/binutils-2.15.92.0.2-r7
!!! If you need support, post the topmost build error, NOT this status message.