All pastes #11812 Raw Edit

qt-error. paste2.

public text v1 · immutable
#11812 ·published 2005-05-15 18:10 UTC
rendered paste body
g++ -c -pipe -fno-exceptions -fPIC -Wall -W -mcpu=i686 -O2 -D_REENTRANT  -DDESIGNER -DQT_INTERNAL_XML -DQT_INTERNAL_WORKSPACE -DQT_INTERNAL_ICONVIEW -DQT_INTERNAL_TABLE -DQT_TABLET_SUPPORT -DQT_NO_DEBUG -DQT_THREAD_SUPPORT -DQT_SHARED -I/var/tmp/portage/qt-3.3.4-r3/work/qt-x11-free-3.3.4/mkspecs/linux-g++ -I. -I/usr/include/freetype2 -I../shared -I../uilib -I../../../include -I.moc/release-shared-mt/ -o ./dbconnectionimpl.o dbconnectionimpl.cpp
g++ -c -pipe -fno-exceptions -fPIC -Wall -W -mcpu=i686 -O2 -D_REENTRANT  -DDESIGNER -DQT_INTERNAL_XML -DQT_INTERNAL_WORKSPACE -DQT_INTERNAL_ICONVIEW -DQT_INTERNAL_TABLE -DQT_TABLET_SUPPORT -DQT_NO_DEBUG -DQT_THREAD_SUPPORT -DQT_SHARED -I/var/tmp/portage/qt-3.3.4-r3/work/qt-x11-free-3.3.4/mkspecs/linux-g++ -I. -I/usr/include/freetype2 -I../shared -I../uilib -I../../../include -I.moc/release-shared-mt/ -o ./dbconnectionsimpl.o dbconnectionsimpl.cpp
g++ -c -pipe -fno-exceptions -fPIC -Wall -W -mcpu=i686 -O2 -D_REENTRANT  -DDESIGNER -DQT_INTERNAL_XML -DQT_INTERNAL_WORKSPACE -DQT_INTERNAL_ICONVIEW -DQT_INTERNAL_TABLE -DQT_TABLET_SUPPORT -DQT_NO_DEBUG -DQT_THREAD_SUPPORT -DQT_SHARED -I/var/tmp/portage/qt-3.3.4-r3/work/qt-x11-free-3.3.4/mkspecs/linux-g++ -I. -I/usr/include/freetype2 -I../shared -I../uilib -I../../../include -I.moc/release-shared-mt/ -o ./tableeditorimpl.o tableeditorimpl.cpp
/var/tmp/portage/qt-3.3.4-r3/work/qt-x11-free-3.3.4/bin/uic -L /var/tmp/portage/qt-3.3.4-r3/work/qt-x11-free-3.3.4/plugins listboxeditor.ui -i listboxeditor.h -o listboxeditor.cpp
Inconsistency detected by ld.so: ../sysdeps/i386/dl-machine.h: 649: elf_machine_rel_relative: Assertion `((reloc->r_info) & 0xff) == 8' failed!
make[3]: *** [listboxeditor.cpp] Error 127
make[3]: Leaving directory `/var/tmp/portage/qt-3.3.4-r3/work/qt-x11-free-3.3.4/tools/designer/designer'
make[2]: *** [sub-designer] Error 2
make[2]: Leaving directory `/var/tmp/portage/qt-3.3.4-r3/work/qt-x11-free-3.3.4/tools/designer'
make[1]: *** [sub-designer] Error 2
make[1]: Leaving directory `/var/tmp/portage/qt-3.3.4-r3/work/qt-x11-free-3.3.4/tools'
make: *** [sub-tools] Error 2

!!! ERROR: x11-libs/qt-3.3.4-r3 failed.
!!! Function src_compile, Line 150, Exitcode 2
!!! (no error message)
!!! If you need support, post the topmost build error, NOT this status message.