+ Error stacktraces are turned on.
[INFO] Scanning for projects...
[INFO] Reactor build order:
[INFO] DSpace Parent Project
[INFO] DSpace Kernel :: API and Implementation
[INFO] DSpace JSP-UI
[INFO] DSpace JSP-UI :: API and Implementation
[INFO] DSpace JSP-UI :: Web Application Resources
[INFO] DSpace XML-UI (Manakin)
[INFO] DSpace XML-UI (Manakin) :: Wing-Framework
[INFO] DSpace XML-UI (Manakin) :: API and Core Aspects
[INFO] DSpace XML-UI (Manakin) :: Web Application Resources
[INFO] DSpace LNI
[INFO] DSpace LNI :: Core Implementation
[INFO] DSpace LNI :: Web Application Resources
[INFO] DSpace LNI :: CLI Client Application
[INFO] DSpace OAI
[INFO] DSpace OAI :: API and Implementation
[INFO] DSpace OAI :: Web Application Resources
[INFO] DSpace SWORD
[INFO] DSpace SWORD :: API and Implementation
[INFO] DSpace SWORD :: Web Application Resources
[INFO] DSpace Addon Modules
[INFO] DSpace XML-UI (Manakin) :: Web Application
[INFO] DSpace LNI :: Web Application
[INFO] DSpace OAI :: Web Application
[INFO] DSpace JSP-UI :: Web Application
[INFO] DSpace SWORD :: Web Application
[INFO] DSpace Assembly and Configuration
[INFO] ------------------------------------------------------------------------
[INFO] Building DSpace Parent Project
[INFO] task-segment: [install]
[INFO] ------------------------------------------------------------------------
[INFO] [site:attach-descriptor]
[INFO] [install:install]
[INFO] Installing /home/shadow/dspace-1.5.0-src-release/pom.xml to /.m2/repository/org/dspace/dspace-parent/1.5.0/dspace-parent-1.5.0.pom
[INFO] ------------------------------------------------------------------------
[INFO] Building DSpace Kernel :: API and Implementation
[INFO] task-segment: [install]
[INFO] ------------------------------------------------------------------------
[INFO] [resources:resources]
[INFO] Using default encoding to copy filtered resources.
[INFO] [compiler:compile]
[INFO] Compiling 227 source files to /home/shadow/dspace-1.5.0-src-release/dspace-api/target/classes
[INFO] ------------------------------------------------------------------------
[ERROR] BUILD FAILURE
[INFO] ------------------------------------------------------------------------
[INFO] Compilation failure
/home/shadow/dspace-1.5.0-src-release/dspace-api/src/main/java/org/dspace/content/Bitstream.java:[56,35] cannot find symbol
symbol : class BitstreamStorageManager
location: package org.dspace.storage.bitstore
/home/shadow/dspace-1.5.0-src-release/dspace-api/src/main/java/org/dspace/content/crosswalk/PREMISCrosswalk.java:[77,15] cannot find symbol
symbol: class IngestionCrosswalk
implements IngestionCrosswalk, DisseminationCrosswalk
/home/shadow/dspace-1.5.0-src-release/dspace-api/src/main/java/org/dspace/content/crosswalk/PREMISCrosswalk.java:[77,35] cannot find symbol
symbol: class DisseminationCrosswalk
implements IngestionCrosswalk, DisseminationCrosswalk
/home/shadow/dspace-1.5.0-src-release/dspace-api/src/main/java/org/dspace/content/crosswalk/PREMISCrosswalk.java:[97,15] cannot find symbol
symbol : class CrosswalkException
location: class org.dspace.content.crosswalk.PREMISCrosswalk
/home/shadow/dspace-1.5.0-src-release/dspace-api/src/main/java/org/dspace/content/crosswalk/PREMISCrosswalk.java:[105,15] cannot find symbol
symbol : class CrosswalkException
location: class org.dspace.content.crosswalk.PREMISCrosswalk
/home/shadow/dspace-1.5.0-src-release/dspace-api/src/main/java/org/dspace/content/crosswalk/PREMISCrosswalk.java:[226,15] cannot find symbol
symbol : class CrosswalkException
location: class org.dspace.content.crosswalk.PREMISCrosswalk
/home/shadow/dspace-1.5.0-src-release/dspace-api/src/main/java/org/dspace/content/crosswalk/PREMISCrosswalk.java:[336,15] cannot find symbol
symbol : class CrosswalkException
location: class org.dspace.content.crosswalk.PREMISCrosswalk
/home/shadow/dspace-1.5.0-src-release/dspace-api/src/main/java/org/dspace/content/packager/PackageUtils.java:[79,15] cannot find symbol
symbol : class PackageValidationException
location: class org.dspace.content.packager.PackageUtils
/home/shadow/dspace-1.5.0-src-release/dspace-api/src/main/java/org/dspace/checker/BitstreamDAO.java:[41,35] cannot find symbol
symbol : class BitstreamStorageManager
location: package org.dspace.storage.bitstore
/home/shadow/dspace-1.5.0-src-release/dspace-api/src/main/java/org/dspace/content/crosswalk/QDCCrosswalk.java:[127,15] cannot find symbol
symbol: class DisseminationCrosswalk
implements DisseminationCrosswalk, IngestionCrosswalk
/home/shadow/dspace-1.5.0-src-release/dspace-api/src/main/java/org/dspace/content/crosswalk/QDCCrosswalk.java:[127,39] cannot find symbol
symbol: class IngestionCrosswalk
implements DisseminationCrosswalk, IngestionCrosswalk
/home/shadow/dspace-1.5.0-src-release/dspace-api/src/main/java/org/dspace/content/crosswalk/QDCCrosswalk.java:[244,15] cannot find symbol
symbol : class CrosswalkException
location: class org.dspace.content.crosswalk.QDCCrosswalk
/home/shadow/dspace-1.5.0-src-release/dspace-api/src/main/java/org/dspace/content/crosswalk/QDCCrosswalk.java:[347,15] cannot find symbol
symbol : class CrosswalkException
location: class org.dspace.content.crosswalk.QDCCrosswalk
/home/shadow/dspace-1.5.0-src-release/dspace-api/src/main/java/org/dspace/content/crosswalk/QDCCrosswalk.java:[354,15] cannot find symbol
symbol : class CrosswalkException
location: class org.dspace.content.crosswalk.QDCCrosswalk
/home/shadow/dspace-1.5.0-src-release/dspace-api/src/main/java/org/dspace/content/crosswalk/QDCCrosswalk.java:[395,15] cannot find symbol
symbol : class CrosswalkException
location: class org.dspace.content.crosswalk.QDCCrosswalk
/home/shadow/dspace-1.5.0-src-release/dspace-api/src/main/java/org/dspace/content/crosswalk/QDCCrosswalk.java:[412,15] cannot find symbol
symbol : class CrosswalkException
location: class org.dspace.content.crosswalk.QDCCrosswalk
/home/shadow/dspace-1.5.0-src-release/dspace-api/src/main/java/org/dspace/content/crosswalk/QDCCrosswalk.java:[426,15] cannot find symbol
symbol : class CrosswalkException
location: class org.dspace.content.crosswalk.QDCCrosswalk
/home/shadow/dspace-1.5.0-src-release/dspace-api/src/main/java/org/dspace/content/packager/METSManifest.java:[59,36] cannot find symbol
symbol : class CrosswalkException
location: package org.dspace.content.crosswalk
/home/shadow/dspace-1.5.0-src-release/dspace-api/src/main/java/org/dspace/content/packager/METSManifest.java:[60,36] cannot find symbol
symbol : class CrosswalkObjectNotSupported
location: package org.dspace.content.crosswalk
/home/shadow/dspace-1.5.0-src-release/dspace-api/src/main/java/org/dspace/content/packager/METSManifest.java:[61,36] cannot find symbol
symbol : class MetadataValidationException
location: package org.dspace.content.crosswalk
/home/shadow/dspace-1.5.0-src-release/dspace-api/src/main/java/org/dspace/content/packager/METSManifest.java:[62,36] cannot find symbol
symbol : class IngestionCrosswalk
location: package org.dspace.content.crosswalk
/home/shadow/dspace-1.5.0-src-release/dspace-api/src/main/java/org/dspace/content/packager/METSManifest.java:[269,12] cannot find symbol
symbol : class MetadataValidationException
location: class org.dspace.content.packager.METSManifest
/home/shadow/dspace-1.5.0-src-release/dspace-api/src/main/java/org/dspace/content/packager/METSManifest.java:[323,15] cannot find symbol
symbol : class MetadataValidationException
location: class org.dspace.content.packager.METSManifest
/home/shadow/dspace-1.5.0-src-release/dspace-api/src/main/java/org/dspace/content/packager/METSManifest.java:[354,15] cannot find symbol
symbol : class MetadataValidationException
location: class org.dspace.content.packager.METSManifest
/home/shadow/dspace-1.5.0-src-release/dspace-api/src/main/java/org/dspace/content/packager/METSManifest.java:[430,15] cannot find symbol
symbol : class MetadataValidationException
location: class org.dspace.content.packager.METSManifest
/home/shadow/dspace-1.5.0-src-release/dspace-api/src/main/java/org/dspace/content/packager/METSManifest.java:[449,15] cannot find symbol
symbol : class MetadataValidationException
location: class org.dspace.content.packager.METSManifest
/home/shadow/dspace-1.5.0-src-release/dspace-api/src/main/java/org/dspace/content/packager/METSManifest.java:[487,15] cannot find symbol
symbol : class MetadataValidationException
location: class org.dspace.content.packager.METSManifest
/home/shadow/dspace-1.5.0-src-release/dspace-api/src/main/java/org/dspace/content/packager/METSManifest.java:[506,15] cannot find symbol
symbol : class MetadataValidationException
location: class org.dspace.content.packager.METSManifest
/home/shadow/dspace-1.5.0-src-release/dspace-api/src/main/java/org/dspace/content/packager/METSManifest.java:[526,15] cannot find symbol
symbol : class MetadataValidationException
location: class org.dspace.content.packager.METSManifest
/home/shadow/dspace-1.5.0-src-release/dspace-api/src/main/java/org/dspace/content/packager/METSManifest.java:[550,15] cannot find symbol
symbol : class MetadataValidationException
location: class org.dspace.content.packager.METSManifest
/home/shadow/dspace-1.5.0-src-release/dspace-api/src/main/java/org/dspace/content/packager/METSManifest.java:[623,15] cannot find symbol
symbol : class MetadataValidationException
location: class org.dspace.content.packager.METSManifest
/home/shadow/dspace-1.5.0-src-release/dspace-api/src/main/java/org/dspace/content/packager/METSManifest.java:[663,16] cannot find symbol
symbol : class IngestionCrosswalk
location: class org.dspace.content.packager.METSManifest
/home/shadow/dspace-1.5.0-src-release/dspace-api/src/main/java/org/dspace/content/packager/METSManifest.java:[664,15] cannot find symbol
symbol : class CrosswalkException
location: class org.dspace.content.packager.METSManifest
/home/shadow/dspace-1.5.0-src-release/dspace-api/src/main/java/org/dspace/content/packager/METSManifest.java:[683,15] cannot find symbol
symbol : class MetadataValidationException
location: class org.dspace.content.packager.METSManifest
/home/shadow/dspace-1.5.0-src-release/dspace-api/src/main/java/org/dspace/content/packager/METSManifest.java:[700,15] cannot find symbol
symbol : class MetadataValidationException
location: class org.dspace.content.packager.METSManifest
/home/shadow/dspace-1.5.0-src-release/dspace-api/src/main/java/org/dspace/content/packager/METSManifest.java:[727,12] cannot find symbol
symbol : class IngestionCrosswalk
location: class org.dspace.content.packager.METSManifest
/home/shadow/dspace-1.5.0-src-release/dspace-api/src/main/java/org/dspace/content/packager/METSManifest.java:[744,15] cannot find symbol
symbol : class MetadataValidationException
location: class org.dspace.content.packager.METSManifest
/home/shadow/dspace-1.5.0-src-release/dspace-api/src/main/java/org/dspace/content/packager/METSManifest.java:[765,15] cannot find symbol
symbol : class MetadataValidationException
location: class org.dspace.content.packager.METSManifest
/home/shadow/dspace-1.5.0-src-release/dspace-api/src/main/java/org/dspace/content/packager/METSManifest.java:[791,15] cannot find symbol
symbol : class MetadataValidationException
location: class org.dspace.content.packager.METSManifest
/home/shadow/dspace-1.5.0-src-release/dspace-api/src/main/java/org/dspace/content/packager/METSManifest.java:[792,15] cannot find symbol
symbol : class CrosswalkException
location: class org.dspace.content.packager.METSManifest
/home/shadow/dspace-1.5.0-src-release/dspace-api/src/main/java/org/dspace/content/packager/METSManifest.java:[813,15] cannot find symbol
symbol : class MetadataValidationException
location: class org.dspace.content.packager.METSManifest
/home/shadow/dspace-1.5.0-src-release/dspace-api/src/main/java/org/dspace/content/packager/METSManifest.java:[814,15] cannot find symbol
symbol : class CrosswalkException
location: class org.dspace.content.packager.METSManifest
/home/shadow/dspace-1.5.0-src-release/dspace-api/src/main/java/org/dspace/content/packager/METSManifest.java:[858,15] cannot find symbol
symbol : class MetadataValidationException
location: class org.dspace.content.packager.METSManifest
/home/shadow/dspace-1.5.0-src-release/dspace-api/src/main/java/org/dspace/content/packager/METSManifest.java:[147,19] cannot find symbol
symbol : class MetadataValidationException
location: interface org.dspace.content.packager.METSManifest.Mdref
/home/shadow/dspace-1.5.0-src-release/dspace-api/src/main/java/org/dspace/app/packager/Packager.java:[58,35] cannot find symbol
symbol : class PackageDisseminator
location: package org.dspace.content.packager
/home/shadow/dspace-1.5.0-src-release/dspace-api/src/main/java/org/dspace/sort/OrderFormatTitle.java:[45,30] cannot find symbol
symbol : class StandardInitialArticleWord
location: package org.dspace.text.filter
/home/shadow/dspace-1.5.0-src-release/dspace-api/src/main/java/org/dspace/content/packager/PDFPackager.java:[59,36] cannot find symbol
symbol : class CrosswalkException
location: package org.dspace.content.crosswalk
/home/shadow/dspace-1.5.0-src-release/dspace-api/src/main/java/org/dspace/content/packager/PDFPackager.java:[60,36] cannot find symbol
symbol : class MetadataValidationException
location: package org.dspace.content.crosswalk
/home/shadow/dspace-1.5.0-src-release/dspace-api/src/main/java/org/dspace/content/packager/PackageIngester.java:[51,36] cannot find symbol
symbol : class CrosswalkException
location: package org.dspace.content.crosswalk
/home/shadow/dspace-1.5.0-src-release/dspace-api/src/main/java/org/dspace/content/packager/PDFPackager.java:[88,35] cannot find symbol
symbol: class PackageDisseminator
implements PackageIngester, PackageDisseminator
/home/shadow/dspace-1.5.0-src-release/dspace-api/src/main/java/org/dspace/content/packager/PDFPackager.java:[139,15] cannot find symbol
symbol : class PackageValidationException
location: class org.dspace.content.packager.PDFPackager
/home/shadow/dspace-1.5.0-src-release/dspace-api/src/main/java/org/dspace/content/packager/PDFPackager.java:[139,43] cannot find symbol
symbol : class CrosswalkException
location: class org.dspace.content.packager.PDFPackager
/home/shadow/dspace-1.5.0-src-release/dspace-api/src/main/java/org/dspace/content/packager/PDFPackager.java:[224,15] cannot find symbol
symbol : class PackageValidationException
location: class org.dspace.content.packager.PDFPackager
/home/shadow/dspace-1.5.0-src-release/dspace-api/src/main/java/org/dspace/content/packager/PDFPackager.java:[224,43] cannot find symbol
symbol : class CrosswalkException
location: class org.dspace.content.packager.PDFPackager
/home/shadow/dspace-1.5.0-src-release/dspace-api/src/main/java/org/dspace/content/packager/PDFPackager.java:[238,15] cannot find symbol
symbol : class PackageValidationException
location: class org.dspace.content.packager.PDFPackager
/home/shadow/dspace-1.5.0-src-release/dspace-api/src/main/java/org/dspace/content/packager/PDFPackager.java:[238,43] cannot find symbol
symbol : class CrosswalkException
location: class org.dspace.content.packager.PDFPackager
/home/shadow/dspace-1.5.0-src-release/dspace-api/src/main/java/org/dspace/content/packager/PDFPackager.java:[270,15] cannot find symbol
symbol : class CrosswalkException
location: class org.dspace.content.packager.PDFPackager
/home/shadow/dspace-1.5.0-src-release/dspace-api/src/main/java/org/dspace/content/packager/PackageIngester.java:[101,33] cannot find symbol
symbol : class CrosswalkException
location: interface org.dspace.content.packager.PackageIngester
/home/shadow/dspace-1.5.0-src-release/dspace-api/src/main/java/org/dspace/content/packager/PackageIngester.java:[124,15] cannot find symbol
symbol : class CrosswalkException
location: interface org.dspace.content.packager.PackageIngester
/home/shadow/dspace-1.5.0-src-release/dspace-api/src/main/java/org/dspace/content/Bitstream.java:[194,26] cannot find symbol
symbol : variable BitstreamStorageManager
location: class org.dspace.content.Bitstream
/home/shadow/dspace-1.5.0-src-release/dspace-api/src/main/java/org/dspace/content/Bitstream.java:[227,26] cannot find symbol
symbol : variable BitstreamStorageManager
location: class org.dspace.content.Bitstream
/home/shadow/dspace-1.5.0-src-release/dspace-api/src/main/java/org/dspace/content/Bitstream.java:[545,8] cannot find symbol
symbol : variable BitstreamStorageManager
location: class org.dspace.content.Bitstream
/home/shadow/dspace-1.5.0-src-release/dspace-api/src/main/java/org/dspace/content/Bitstream.java:[563,15] cannot find symbol
symbol : variable BitstreamStorageManager
location: class org.dspace.content.Bitstream
/home/shadow/dspace-1.5.0-src-release/dspace-api/src/main/java/org/dspace/content/Bitstream.java:[628,15] cannot find symbol
symbol : variable BitstreamStorageManager
location: class org.dspace.content.Bitstream
/home/shadow/dspace-1.5.0-src-release/dspace-api/src/main/java/org/dspace/content/crosswalk/PREMISCrosswalk.java:[100,22] cannot find symbol
symbol : class MetadataValidationException
location: class org.dspace.content.crosswalk.PREMISCrosswalk
/home/shadow/dspace-1.5.0-src-release/dspace-api/src/main/java/org/dspace/content/crosswalk/PREMISCrosswalk.java:[109,22] cannot find symbol
symbol : class CrosswalkObjectNotSupported
location: class org.dspace.content.crosswalk.PREMISCrosswalk
/home/shadow/dspace-1.5.0-src-release/dspace-api/src/main/java/org/dspace/content/crosswalk/PREMISCrosswalk.java:[144,42] cannot find symbol
symbol : class MetadataValidationException
location: class org.dspace.content.crosswalk.PREMISCrosswalk
/home/shadow/dspace-1.5.0-src-release/dspace-api/src/main/java/org/dspace/content/crosswalk/PREMISCrosswalk.java:[150,38] cannot find symbol
symbol : class MetadataValidationException
location: class org.dspace.content.crosswalk.PREMISCrosswalk
/home/shadow/dspace-1.5.0-src-release/dspace-api/src/main/java/org/dspace/content/crosswalk/PREMISCrosswalk.java:[167,42] cannot find symbol
symbol : class MetadataValidationException
location: class org.dspace.content.crosswalk.PREMISCrosswalk
/home/shadow/dspace-1.5.0-src-release/dspace-api/src/main/java/org/dspace/content/crosswalk/PREMISCrosswalk.java:[230,22] cannot find symbol
symbol : class CrosswalkObjectNotSupported
location: class org.dspace.content.crosswalk.PREMISCrosswalk
/home/shadow/dspace-1.5.0-src-release/dspace-api/src/main/java/org/dspace/content/packager/PackageUtils.java:[83,22] cannot find symbol
symbol : class PackageValidationException
location: class org.dspace.content.packager.PackageUtils
/home/shadow/dspace-1.5.0-src-release/dspace-api/src/main/java/org/dspace/checker/BitstreamDAO.java:[87,17] cannot find symbol
symbol : variable BitstreamStorageManager
location: class org.dspace.checker.BitstreamDAO
/home/shadow/dspace-1.5.0-src-release/dspace-api/src/main/java/org/dspace/content/crosswalk/QDCCrosswalk.java:[198,63] cannot find symbol
symbol : variable DisseminationCrosswalk
location: class org.dspace.content.crosswalk.QDCCrosswalk
/home/shadow/dspace-1.5.0-src-release/dspace-api/src/main/java/org/dspace/content/crosswalk/QDCCrosswalk.java:[252,22] cannot find symbol
symbol : class CrosswalkInternalException
location: class org.dspace.content.crosswalk.QDCCrosswalk
/home/shadow/dspace-1.5.0-src-release/dspace-api/src/main/java/org/dspace/content/crosswalk/QDCCrosswalk.java:[276,22] cannot find symbol
symbol : class CrosswalkInternalException
location: class org.dspace.content.crosswalk.QDCCrosswalk
/home/shadow/dspace-1.5.0-src-release/dspace-api/src/main/java/org/dspace/content/crosswalk/QDCCrosswalk.java:[314,26] cannot find symbol
symbol : class CrosswalkInternalException
location: class org.dspace.content.crosswalk.QDCCrosswalk
/home/shadow/dspace-1.5.0-src-release/dspace-api/src/main/java/org/dspace/content/crosswalk/QDCCrosswalk.java:[358,22] cannot find symbol
symbol : class CrosswalkObjectNotSupported
location: class org.dspace.content.crosswalk.QDCCrosswalk
/home/shadow/dspace-1.5.0-src-release/dspace-api/src/main/java/org/dspace/content/crosswalk/QDCCrosswalk.java:[385,70] cannot find symbol
symbol : variable XSI_NS
location: class org.dspace.content.crosswalk.QDCCrosswalk
/home/shadow/dspace-1.5.0-src-release/dspace-api/src/main/java/org/dspace/content/crosswalk/QDCCrosswalk.java:[401,64] cannot find symbol
symbol : variable XSI_NS
location: class org.dspace.content.crosswalk.QDCCrosswalk
/home/shadow/dspace-1.5.0-src-release/dspace-api/src/main/java/org/dspace/content/crosswalk/QDCCrosswalk.java:[421,22] cannot find symbol
symbol : class MetadataValidationException
location: class org.dspace.content.crosswalk.QDCCrosswalk
/home/shadow/dspace-1.5.0-src-release/dspace-api/src/main/java/org/dspace/content/crosswalk/QDCCrosswalk.java:[432,22] cannot find symbol
symbol : class CrosswalkInternalException
location: class org.dspace.content.crosswalk.QDCCrosswalk
/home/shadow/dspace-1.5.0-src-release/dspace-api/src/main/java/org/dspace/content/crosswalk/QDCCrosswalk.java:[460,30] cannot find symbol
symbol : class CrosswalkInternalException
location: class org.dspace.content.crosswalk.QDCCrosswalk
/home/shadow/dspace-1.5.0-src-release/dspace-api/src/main/java/org/dspace/content/packager/METSManifest.java:[301,22] cannot find symbol
symbol : class MetadataValidationException
location: class org.dspace.content.packager.METSManifest
/home/shadow/dspace-1.5.0-src-release/dspace-api/src/main/java/org/dspace/content/packager/METSManifest.java:[330,22] cannot find symbol
symbol : class MetadataValidationException
location: class org.dspace.content.packager.METSManifest
/home/shadow/dspace-1.5.0-src-release/dspace-api/src/main/java/org/dspace/content/packager/METSManifest.java:[368,26] cannot find symbol
symbol : class MetadataValidationException
location: class org.dspace.content.packager.METSManifest
/home/shadow/dspace-1.5.0-src-release/dspace-api/src/main/java/org/dspace/content/packager/METSManifest.java:[435,22] cannot find symbol
symbol : class MetadataValidationException
location: class org.dspace.content.packager.METSManifest
/home/shadow/dspace-1.5.0-src-release/dspace-api/src/main/java/org/dspace/content/packager/METSManifest.java:[459,30] cannot find symbol
symbol : class MetadataValidationException
location: class org.dspace.content.packager.METSManifest
/home/shadow/dspace-1.5.0-src-release/dspace-api/src/main/java/org/dspace/content/packager/METSManifest.java:[461,30] cannot find symbol
symbol : class MetadataValidationException
location: class org.dspace.content.packager.METSManifest
/home/shadow/dspace-1.5.0-src-release/dspace-api/src/main/java/org/dspace/content/packager/METSManifest.java:[467,22] cannot find symbol
symbol : class MetadataValidationException
location: class org.dspace.content.packager.METSManifest
/home/shadow/dspace-1.5.0-src-release/dspace-api/src/main/java/org/dspace/content/packager/METSManifest.java:[473,26] cannot find symbol
symbol : class MetadataValidationException
location: class org.dspace.content.packager.METSManifest
/home/shadow/dspace-1.5.0-src-release/dspace-api/src/main/java/org/dspace/content/packager/METSManifest.java:[476,18] cannot find symbol
symbol : class MetadataValidationException
location: class org.dspace.content.packager.METSManifest
/home/shadow/dspace-1.5.0-src-release/dspace-api/src/main/java/org/dspace/content/packager/METSManifest.java:[495,22] cannot find symbol
symbol : class MetadataValidationException
location: class org.dspace.content.packager.METSManifest
/home/shadow/dspace-1.5.0-src-release/dspace-api/src/main/java/org/dspace/content/packager/METSManifest.java:[498,22] cannot find symbol
symbol : class MetadataValidationException
location: class org.dspace.content.packager.METSManifest
/home/shadow/dspace-1.5.0-src-release/dspace-api/src/main/java/org/dspace/content/packager/METSManifest.java:[512,22] cannot find symbol
symbol : class MetadataValidationException
location: class org.dspace.content.packager.METSManifest
/home/shadow/dspace-1.5.0-src-release/dspace-api/src/main/java/org/dspace/content/packager/METSManifest.java:[517,22] cannot find symbol
symbol : class MetadataValidationException
location: class org.dspace.content.packager.METSManifest
/home/shadow/dspace-1.5.0-src-release/dspace-api/src/main/java/org/dspace/content/packager/METSManifest.java:[563,34] cannot find symbol
symbol : class MetadataValidationException
location: class org.dspace.content.packager.METSManifest
/home/shadow/dspace-1.5.0-src-release/dspace-api/src/main/java/org/dspace/content/packager/METSManifest.java:[606,26] cannot find symbol
symbol : class MetadataValidationException
location: class org.dspace.content.packager.METSManifest
/home/shadow/dspace-1.5.0-src-release/dspace-api/src/main/java/org/dspace/content/packager/METSManifest.java:[610,22] cannot find symbol
symbol : class MetadataValidationException
location: class org.dspace.content.packager.METSManifest
/home/shadow/dspace-1.5.0-src-release/dspace-api/src/main/java/org/dspace/content/packager/METSManifest.java:[634,30] cannot find symbol
symbol : class MetadataValidationException
location: class org.dspace.content.packager.METSManifest
/home/shadow/dspace-1.5.0-src-release/dspace-api/src/main/java/org/dspace/content/packager/METSManifest.java:[654,22] cannot find symbol
symbol : class MetadataValidationException
location: class org.dspace.content.packager.METSManifest
[INFO] ------------------------------------------------------------------------
[INFO] Trace
org.apache.maven.BuildFailureException: Compilation failure
at org.apache.maven.lifecycle.DefaultLifecycleExecutor.executeGoals(DefaultLifecycleExecutor.java:579)
at org.apache.maven.lifecycle.DefaultLifecycleExecutor.executeGoalWithLifecycle(DefaultLifecycleExecutor.java:499)
at org.apache.maven.lifecycle.DefaultLifecycleExecutor.executeGoal(DefaultLifecycleExecutor.java:478)
at org.apache.maven.lifecycle.DefaultLifecycleExecutor.executeGoalAndHandleFailures(DefaultLifecycleExecutor.java:330)
at org.apache.maven.lifecycle.DefaultLifecycleExecutor.executeTaskSegments(DefaultLifecycleExecutor.java:291)
at org.apache.maven.lifecycle.DefaultLifecycleExecutor.execute(DefaultLifecycleExecutor.java:142)
at org.apache.maven.DefaultMaven.doExecute(DefaultMaven.java:336)
at org.apache.maven.DefaultMaven.execute(DefaultMaven.java:129)
at org.apache.maven.cli.MavenCli.main(MavenCli.java:287)
at sun.reflect.NativeMethodAccessorImpl.invoke0(Native Method)
at sun.reflect.NativeMethodAccessorImpl.invoke(NativeMethodAccessorImpl.java:39)
at sun.reflect.DelegatingMethodAccessorImpl.invoke(DelegatingMethodAccessorImpl.java:25)
at java.lang.reflect.Method.invoke(Method.java:585)
at org.codehaus.classworlds.Launcher.launchEnhanced(Launcher.java:315)
at org.codehaus.classworlds.Launcher.launch(Launcher.java:255)
at org.codehaus.classworlds.Launcher.mainWithExitCode(Launcher.java:430)
at org.codehaus.classworlds.Launcher.main(Launcher.java:375)
Caused by: org.apache.maven.plugin.CompilationFailureException: Compilation failure
at org.apache.maven.plugin.AbstractCompilerMojo.execute(AbstractCompilerMojo.java:516)
at org.apache.maven.plugin.CompilerMojo.execute(CompilerMojo.java:114)
at org.apache.maven.plugin.DefaultPluginManager.executeMojo(DefaultPluginManager.java:451)
at org.apache.maven.lifecycle.DefaultLifecycleExecutor.executeGoals(DefaultLifecycleExecutor.java:558)
... 16 more
[INFO] ------------------------------------------------------------------------
[INFO] Total time: 18 seconds
[INFO] Finished at: Tue Aug 12 18:26:28 MSD 2008
[INFO] Final Memory: 13M/48M
[INFO] ------------------------------------------------------------------------