All pastes #11580 Raw Edit

Unnamed

public text v1 · immutable
#11580 ·published 2005-05-12 12:30 UTC
rendered paste body
NOTE: package genext2fs-native-1.3+cvs20050511: started
NOTE: package genext2fs-native-1.3+cvs20050511-r2: task do_fetch: started
NOTE: Update cvs://anonymous:@cvs.sourceforge.net/cvsroot/genext2fs;module=genext2fs
cvs update: Updating .
cvs update: Updating debian
NOTE: package genext2fs-native-1.3+cvs20050511-r2: task do_fetch: completed
NOTE: package genext2fs-native-1.3+cvs20050511-r2: task do_unpack: started
NOTE: Unpacking /home/chris/projects/cl-linux/sources/genext2fs_cvs.sourceforge.net__20050511.tar.gz to /home/chris/projects/cl-linux/build/tmp/work/genext2fs-native-1.3+cvs20050511-r2/
NOTE: package genext2fs-native-1.3+cvs20050511-r2: task do_unpack: completed
NOTE: package genext2fs-native-1.3+cvs20050511-r2: task do_patch: started
NOTE: Applying patch 'bytes_per_inode.patch'
ERROR: function do_patchcmd failed
ERROR: log data follows (/home/chris/projects/cl-linux/build/tmp/work/genext2fs-native-1.3+cvs20050511-r2/temp/log.do_patchcmd.4791)
| Importing patch /home/chris/projects/cl-linux/openembedded/packages/genext2fs/genext2fs-1.3+cvs/bytes_per_inode.patch (stored as bytes_per_inode.patch)
| Applying patch bytes_per_inode.patch
| patching file genext2fs.c
| Hunk #1 FAILED at 2284.
| Hunk #2 FAILED at 2315.
| Hunk #3 FAILED at 2347.
| Hunk #4 FAILED at 2362.
| Hunk #5 succeeded at 2388 with fuzz 2 (offset 13 lines).
| Hunk #6 FAILED at 2487.
| 5 out of 6 hunks FAILED -- rejects in file genext2fs.c
| Patch bytes_per_inode.patch does not apply (enforce with -f)
NOTE: Task failed:
NOTE: package genext2fs-native-1.3+cvs20050511-r2: task do_patch: failed
ERROR: TaskFailed event exception, aborting
NOTE: package genext2fs-native-1.3+cvs20050511: failed
ERROR: Build of bootstrap-image failed