All pastes #114809 Raw Edit

Untitled

public text v1 · immutable
·published 2006-08-04 05:52 UTC
rendered paste body
if test "/home/bhuvan/projects/subversion/subversion/bindings/swig/perl" != "/home/bhuvan/projects/subversion/subversion/bindings/swig/perl"; then \
	  ln -sf /home/bhuvan/projects/subversion/subversion/bindings/swig/perl/native/*.c /home/bhuvan/projects/subversion/subversion/bindings/swig/perl/native; \
	fi
cd /home/bhuvan/projects/subversion/subversion/bindings/swig/perl/native; make
make[1]: Entering directory `/home/bhuvan/projects/subversion/subversion/bindings/swig/perl/native'
make[1]: Leaving directory `/home/bhuvan/projects/subversion/subversion/bindings/swig/perl/native'
cd /home/bhuvan/projects/subversion/subversion/bindings/swig/perl/native; make test
make[1]: Entering directory `/home/bhuvan/projects/subversion/subversion/bindings/swig/perl/native'
PERL_DL_NONLAZY=1 LD_LIBRARY_PATH=/home/bhuvan/projects/subversion/subversion/bindings/swig/perl/libsvn_swig_perl/.libs:/home/bhuvan/projects/subversion/subversion/libsvn_client/.libs:/home/bhuvan/projects/subversion/subversion/libsvn_delta/.libs:/home/bhuvan/projects/subversion/subversion/libsvn_fs/.libs:/home/bhuvan/projects/subversion/subversion/libsvn_ra/.libs:/home/bhuvan/projects/subversion/subversion/libsvn_repos/.libs:/home/bhuvan/projects/subversion/subversion/libsvn_wc/.libs:/home/bhuvan/projects/subversion/subversion/libsvn_diff/.libs:/home/bhuvan/projects/subversion/subversion/libsvn_subr/.libs:/home/bhuvan/projects/subversion/subversion/libsvn_ra_local/.libs:/home/bhuvan/projects/subversion/subversion/libsvn_ra_svn/.libs:/home/bhuvan/projects/subversion/subversion/libsvn_ra_dav/.libs:/home/bhuvan/projects/subversion/subversion/libsvn_fs_base/.libs:/home/bhuvan/projects/subversion/subversion/libsvn_fs_fs/.libs /usr/bin/perl "-MExtUtils::Command::MM" "-e" "test_harness(0, 'blib/lib', 'blib/arch')" ../../../../../subversion/bindings/swig/perl/native/t/*.t
../../../../../subversion/bindings/swig/perl/native/t/0use.............
#     Failed test (../../../../../subversion/bindings/swig/perl/native/t/0use.t at line 5)
#     Tried to use 'SVN::Core'.
#     Error:  Can't load '/home/bhuvan/projects/subversion/subversion/bindings/swig/perl/native/blib/arch/auto/SVN/_Core/_Core.so' for module SVN::_Core: /home/bhuvan/projects/subversion/subversion/bindings/swig/perl/native/blib/arch/auto/SVN/_Core/_Core.so: undefined symbol: apr_palloc at /usr/lib/perl/5.8/DynaLoader.pm line 225.
#  at /home/bhuvan/projects/subversion/subversion/bindings/swig/perl/native/blib/lib/SVN/Base.pm line 59
# BEGIN failed--compilation aborted at ../../../../../subversion/bindings/swig/perl/native/t/0use.t line 5.
# Compilation failed in require at (eval 3) line 2.
# BEGIN failed--compilation aborted at (eval 3) line 2.

#     Failed test (../../../../../subversion/bindings/swig/perl/native/t/0use.t at line 6)
#     Tried to use 'SVN::Repos'.
#     Error:  Can't locate loadable object for module SVN::_Repos in @INC (@INC contains: /home/bhuvan/projects/subversion/subversion/bindings/swig/perl/native/blib/lib /home/bhuvan/projects/subversion/subversion/bindings/swig/perl/native/blib/arch /etc/perl /usr/local/lib/perl/5.8.7 /usr/local/share/perl/5.8.7 /usr/lib/perl5 /usr/share/perl5 /usr/lib/perl/5.8 /usr/share/perl/5.8 /usr/local/lib/site_perl .) at /home/bhuvan/projects/subversion/subversion/bindings/swig/perl/native/blib/lib/SVN/Base.pm line 59
# BEGIN failed--compilation aborted at ../../../../../subversion/bindings/swig/perl/native/t/0use.t line 6.
# Compilation failed in require at (eval 5) line 2.
# BEGIN failed--compilation aborted at (eval 5) line 2.

#     Failed test (../../../../../subversion/bindings/swig/perl/native/t/0use.t at line 7)
#     Tried to use 'SVN::Fs'.
#     Error:  Can't locate loadable object for module SVN::_Fs in @INC (@INC contains: /home/bhuvan/projects/subversion/subversion/bindings/swig/perl/native/blib/lib /home/bhuvan/projects/subversion/subversion/bindings/swig/perl/native/blib/arch /etc/perl /usr/local/lib/perl/5.8.7 /usr/local/share/perl/5.8.7 /usr/lib/perl5 /usr/share/perl5 /usr/lib/perl/5.8 /usr/share/perl/5.8 /usr/local/lib/site_perl .) at /home/bhuvan/projects/subversion/subversion/bindings/swig/perl/native/blib/lib/SVN/Base.pm line 59
# BEGIN failed--compilation aborted at ../../../../../subversion/bindings/swig/perl/native/t/0use.t line 7.
# Compilation failed in require at (eval 7) line 2.
# BEGIN failed--compilation aborted at (eval 7) line 2.

#     Failed test (../../../../../subversion/bindings/swig/perl/native/t/0use.t at line 8)
#     Tried to use 'SVN::Delta'.
#     Error:  Can't locate loadable object for module SVN::_Delta in @INC (@INC contains: /home/bhuvan/projects/subversion/subversion/bindings/swig/perl/native/blib/lib /home/bhuvan/projects/subversion/subversion/bindings/swig/perl/native/blib/arch /etc/perl /usr/local/lib/perl/5.8.7 /usr/local/share/perl/5.8.7 /usr/lib/perl5 /usr/share/perl5 /usr/lib/perl/5.8 /usr/share/perl/5.8 /usr/local/lib/site_perl .) at /home/bhuvan/projects/subversion/subversion/bindings/swig/perl/native/blib/lib/SVN/Base.pm line 59
# BEGIN failed--compilation aborted at ../../../../../subversion/bindings/swig/perl/native/t/0use.t line 8.
# Compilation failed in require at (eval 9) line 2.
# BEGIN failed--compilation aborted at (eval 9) line 2.

#     Failed test (../../../../../subversion/bindings/swig/perl/native/t/0use.t at line 9)
#     Tried to use 'SVN::Ra'.
#     Error:  Can't locate loadable object for module SVN::_Ra in @INC (@INC contains: /home/bhuvan/projects/subversion/subversion/bindings/swig/perl/native/blib/lib /home/bhuvan/projects/subversion/subversion/bindings/swig/perl/native/blib/arch /etc/perl /usr/local/lib/perl/5.8.7 /usr/local/share/perl/5.8.7 /usr/lib/perl5 /usr/share/perl5 /usr/lib/perl/5.8 /usr/share/perl/5.8 /usr/local/lib/site_perl .) at /home/bhuvan/projects/subversion/subversion/bindings/swig/perl/native/blib/lib/SVN/Base.pm line 59
# BEGIN failed--compilation aborted at ../../../../../subversion/bindings/swig/perl/native/t/0use.t line 9.
# Compilation failed in require at (eval 11) line 2.
# BEGIN failed--compilation aborted at (eval 11) line 2.

#     Failed test (../../../../../subversion/bindings/swig/perl/native/t/0use.t at line 10)
#     Tried to use 'SVN::Wc'.
#     Error:  Can't locate loadable object for module SVN::_Wc in @INC (@INC contains: /home/bhuvan/projects/subversion/subversion/bindings/swig/perl/native/blib/lib /home/bhuvan/projects/subversion/subversion/bindings/swig/perl/native/blib/arch /etc/perl /usr/local/lib/perl/5.8.7 /usr/local/share/perl/5.8.7 /usr/lib/perl5 /usr/share/perl5 /usr/lib/perl/5.8 /usr/share/perl/5.8 /usr/local/lib/site_perl .) at /home/bhuvan/projects/subversion/subversion/bindings/swig/perl/native/blib/lib/SVN/Base.pm line 59
# BEGIN failed--compilation aborted at ../../../../../subversion/bindings/swig/perl/native/t/0use.t line 10.
# Compilation failed in require at (eval 13) line 2.
# BEGIN failed--compilation aborted at (eval 13) line 2.

#     Failed test (../../../../../subversion/bindings/swig/perl/native/t/0use.t at line 11)
#     Tried to use 'SVN::Client'.
#     Error:  Can't locate loadable object for module SVN::_Client in @INC (@INC contains: /home/bhuvan/projects/subversion/subversion/bindings/swig/perl/native/blib/lib /home/bhuvan/projects/subversion/subversion/bindings/swig/perl/native/blib/arch /etc/perl /usr/local/lib/perl/5.8.7 /usr/local/share/perl/5.8.7 /usr/lib/perl5 /usr/share/perl5 /usr/lib/perl/5.8 /usr/share/perl/5.8 /usr/local/lib/site_perl .) at /home/bhuvan/projects/subversion/subversion/bindings/swig/perl/native/blib/lib/SVN/Base.pm line 59
# BEGIN failed--compilation aborted at ../../../../../subversion/bindings/swig/perl/native/t/0use.t line 11.
# Compilation failed in require at (eval 15) line 2.
# BEGIN failed--compilation aborted at (eval 15) line 2.
# Looks like you failed 7 tests of 7.
dubious
	Test returned status 7 (wstat 1792, 0x700)
DIED. FAILED tests 1-7
	Failed 7/7 tests, 0.00% okay
../../../../../subversion/bindings/swig/perl/native/t/1repos...........Can't load '/home/bhuvan/projects/subversion/subversion/bindings/swig/perl/native/blib/arch/auto/SVN/_Core/_Core.so' for module SVN::_Core: /home/bhuvan/projects/subversion/subversion/bindings/swig/perl/native/blib/arch/auto/SVN/_Core/_Core.so: undefined symbol: apr_palloc at /usr/lib/perl/5.8/DynaLoader.pm line 225.
 at /home/bhuvan/projects/subversion/subversion/bindings/swig/perl/native/blib/lib/SVN/Base.pm line 59
BEGIN failed--compilation aborted at /home/bhuvan/projects/subversion/subversion/bindings/swig/perl/native/blib/lib/SVN/Core.pm line 5.
Compilation failed in require at ../../../../../subversion/bindings/swig/perl/native/t/1repos.t line 8.
# cleanup
No root path(s) specified at ../../../../../subversion/bindings/swig/perl/native/t/1repos.t line 86
# Looks like your test died before it could output anything.
dubious
	Test returned status 255 (wstat 65280, 0xff00)
DIED. FAILED tests 1-6
	Failed 6/6 tests, 0.00% okay
../../../../../subversion/bindings/swig/perl/native/t/2fs..............Can't load '/home/bhuvan/projects/subversion/subversion/bindings/swig/perl/native/blib/arch/auto/SVN/_Core/_Core.so' for module SVN::_Core: /home/bhuvan/projects/subversion/subversion/bindings/swig/perl/native/blib/arch/auto/SVN/_Core/_Core.so: undefined symbol: apr_palloc at /usr/lib/perl/5.8/DynaLoader.pm line 225.
 at /home/bhuvan/projects/subversion/subversion/bindings/swig/perl/native/blib/lib/SVN/Base.pm line 59
BEGIN failed--compilation aborted at /home/bhuvan/projects/subversion/subversion/bindings/swig/perl/native/blib/lib/SVN/Core.pm line 5.
Compilation failed in require at ../../../../../subversion/bindings/swig/perl/native/t/2fs.t line 7.
# cleanup
No root path(s) specified at ../../../../../subversion/bindings/swig/perl/native/t/2fs.t line 70
# Looks like your test died before it could output anything.
dubious
	Test returned status 255 (wstat 65280, 0xff00)
DIED. FAILED tests 1-16
	Failed 16/16 tests, 0.00% okay
../../../../../subversion/bindings/swig/perl/native/t/3client..........
#     Failed test (../../../../../subversion/bindings/swig/perl/native/t/3client.t at line 11)
#     Tried to use 'SVN::Core'.
#     Error:  Can't load '/home/bhuvan/projects/subversion/subversion/bindings/swig/perl/native/blib/arch/auto/SVN/_Core/_Core.so' for module SVN::_Core: /home/bhuvan/projects/subversion/subversion/bindings/swig/perl/native/blib/arch/auto/SVN/_Core/_Core.so: undefined symbol: apr_palloc at /usr/lib/perl/5.8/DynaLoader.pm line 225.
#  at /home/bhuvan/projects/subversion/subversion/bindings/swig/perl/native/blib/lib/SVN/Base.pm line 59
# BEGIN failed--compilation aborted at ../../../../../subversion/bindings/swig/perl/native/t/3client.t line 11.
# Compilation failed in require at (eval 8) line 2.
# BEGIN failed--compilation aborted at (eval 8) line 2.

#     Failed test (../../../../../subversion/bindings/swig/perl/native/t/3client.t at line 12)
#     Tried to use 'SVN::Repos'.
#     Error:  Can't locate loadable object for module SVN::_Repos in @INC (@INC contains: /home/bhuvan/projects/subversion/subversion/bindings/swig/perl/native/blib/lib /home/bhuvan/projects/subversion/subversion/bindings/swig/perl/native/blib/arch /etc/perl /usr/local/lib/perl/5.8.7 /usr/local/share/perl/5.8.7 /usr/lib/perl5 /usr/share/perl5 /usr/lib/perl/5.8 /usr/share/perl/5.8 /usr/local/lib/site_perl .) at /home/bhuvan/projects/subversion/subversion/bindings/swig/perl/native/blib/lib/SVN/Base.pm line 59
# BEGIN failed--compilation aborted at ../../../../../subversion/bindings/swig/perl/native/t/3client.t line 12.
# Compilation failed in require at (eval 10) line 2.
# BEGIN failed--compilation aborted at (eval 10) line 2.

#     Failed test (../../../../../subversion/bindings/swig/perl/native/t/3client.t at line 13)
#     Tried to use 'SVN::Client'.
#     Error:  Can't locate loadable object for module SVN::_Wc in @INC (@INC contains: /home/bhuvan/projects/subversion/subversion/bindings/swig/perl/native/blib/lib /home/bhuvan/projects/subversion/subversion/bindings/swig/perl/native/blib/arch /etc/perl /usr/local/lib/perl/5.8.7 /usr/local/share/perl/5.8.7 /usr/lib/perl5 /usr/share/perl5 /usr/lib/perl/5.8 /usr/share/perl/5.8 /usr/local/lib/site_perl .) at /home/bhuvan/projects/subversion/subversion/bindings/swig/perl/native/blib/lib/SVN/Base.pm line 59
# BEGIN failed--compilation aborted at ../../../../../subversion/bindings/swig/perl/native/t/3client.t line 13.
# Compilation failed in require at /home/bhuvan/projects/subversion/subversion/bindings/swig/perl/native/blib/lib/SVN/Client.pm line 5.
# BEGIN failed--compilation aborted at /home/bhuvan/projects/subversion/subversion/bindings/swig/perl/native/blib/lib/SVN/Client.pm line 5.
# Compilation failed in require at (eval 12) line 2.
# BEGIN failed--compilation aborted at (eval 12) line 2.
Undefined subroutine &SVN::Repos::create called at ../../../../../subversion/bindings/swig/perl/native/t/3client.t line 40.
# cleanup
# Looks like you planned 117 tests but only ran 4.
# Looks like your test died just after 4.
dubious
	Test returned status 255 (wstat 65280, 0xff00)
DIED. FAILED tests 1-3, 5-117
	Failed 116/117 tests, 0.85% okay
../../../../../subversion/bindings/swig/perl/native/t/4pool............Can't load '/home/bhuvan/projects/subversion/subversion/bindings/swig/perl/native/blib/arch/auto/SVN/_Core/_Core.so' for module SVN::_Core: /home/bhuvan/projects/subversion/subversion/bindings/swig/perl/native/blib/arch/auto/SVN/_Core/_Core.so: undefined symbol: apr_palloc at /usr/lib/perl/5.8/DynaLoader.pm line 225.
 at /home/bhuvan/projects/subversion/subversion/bindings/swig/perl/native/blib/lib/SVN/Base.pm line 59
BEGIN failed--compilation aborted at /home/bhuvan/projects/subversion/subversion/bindings/swig/perl/native/blib/lib/SVN/Core.pm line 5.
Compilation failed in require at ../../../../../subversion/bindings/swig/perl/native/t/4pool.t line 12.
# cleanup
No root path(s) specified at ../../../../../subversion/bindings/swig/perl/native/t/4pool.t line 72
# Looks like your test died before it could output anything.
dubious
	Test returned status 255 (wstat 65280, 0xff00)
DIED. FAILED tests 1-6
	Failed 6/6 tests, 0.00% okay
../../../../../subversion/bindings/swig/perl/native/t/5delta-compat....Can't load '/home/bhuvan/projects/subversion/subversion/bindings/swig/perl/native/blib/arch/auto/SVN/_Core/_Core.so' for module SVN::_Core: /home/bhuvan/projects/subversion/subversion/bindings/swig/perl/native/blib/arch/auto/SVN/_Core/_Core.so: undefined symbol: apr_palloc at /usr/lib/perl/5.8/DynaLoader.pm line 225.
 at /home/bhuvan/projects/subversion/subversion/bindings/swig/perl/native/blib/lib/SVN/Base.pm line 59
BEGIN failed--compilation aborted at /home/bhuvan/projects/subversion/subversion/bindings/swig/perl/native/blib/lib/SVN/Core.pm line 5.
Compilation failed in require at ../../../../../subversion/bindings/swig/perl/native/t/5delta-compat.t line 4.
# Looks like your test died before it could output anything.
dubious
	Test returned status 255 (wstat 65280, 0xff00)
DIED. FAILED tests 1-2
	Failed 2/2 tests, 0.00% okay
../../../../../subversion/bindings/swig/perl/native/t/5delta...........Can't load '/home/bhuvan/projects/subversion/subversion/bindings/swig/perl/native/blib/arch/auto/SVN/_Core/_Core.so' for module SVN::_Core: /home/bhuvan/projects/subversion/subversion/bindings/swig/perl/native/blib/arch/auto/SVN/_Core/_Core.so: undefined symbol: apr_palloc at /usr/lib/perl/5.8/DynaLoader.pm line 225.
 at /home/bhuvan/projects/subversion/subversion/bindings/swig/perl/native/blib/lib/SVN/Base.pm line 59
BEGIN failed--compilation aborted at /home/bhuvan/projects/subversion/subversion/bindings/swig/perl/native/blib/lib/SVN/Core.pm line 5.
Compilation failed in require at ../../../../../subversion/bindings/swig/perl/native/t/5delta.t line 4.
# Looks like your test died before it could output anything.
dubious
	Test returned status 255 (wstat 65280, 0xff00)
DIED. FAILED tests 1-3
	Failed 3/3 tests, 0.00% okay
../../../../../subversion/bindings/swig/perl/native/t/6ra..............Can't load '/home/bhuvan/projects/subversion/subversion/bindings/swig/perl/native/blib/arch/auto/SVN/_Core/_Core.so' for module SVN::_Core: /home/bhuvan/projects/subversion/subversion/bindings/swig/perl/native/blib/arch/auto/SVN/_Core/_Core.so: undefined symbol: apr_palloc at /usr/lib/perl/5.8/DynaLoader.pm line 225.
 at /home/bhuvan/projects/subversion/subversion/bindings/swig/perl/native/blib/lib/SVN/Base.pm line 59
BEGIN failed--compilation aborted at /home/bhuvan/projects/subversion/subversion/bindings/swig/perl/native/blib/lib/SVN/Core.pm line 5.
Compilation failed in require at ../../../../../subversion/bindings/swig/perl/native/t/6ra.t line 8.
BEGIN failed--compilation aborted at ../../../../../subversion/bindings/swig/perl/native/t/6ra.t line 8.
# Looks like your test died before it could output anything.
dubious
	Test returned status 255 (wstat 65280, 0xff00)
DIED. FAILED tests 1-6
	Failed 6/6 tests, 0.00% okay
../../../../../subversion/bindings/swig/perl/native/t/7editor..........Can't load '/home/bhuvan/projects/subversion/subversion/bindings/swig/perl/native/blib/arch/auto/SVN/_Core/_Core.so' for module SVN::_Core: /home/bhuvan/projects/subversion/subversion/bindings/swig/perl/native/blib/arch/auto/SVN/_Core/_Core.so: undefined symbol: apr_palloc at /usr/lib/perl/5.8/DynaLoader.pm line 225.
 at /home/bhuvan/projects/subversion/subversion/bindings/swig/perl/native/blib/lib/SVN/Base.pm line 59
BEGIN failed--compilation aborted at /home/bhuvan/projects/subversion/subversion/bindings/swig/perl/native/blib/lib/SVN/Core.pm line 5.
Compilation failed in require at ../../../../../subversion/bindings/swig/perl/native/t/7editor.t line 15.
# Looks like your test died before it could output anything.
dubious
	Test returned status 255 (wstat 65280, 0xff00)
DIED. FAILED test 1
	Failed 1/1 tests, 0.00% okay
../../../../../subversion/bindings/swig/perl/native/t/8lock............Can't load '/home/bhuvan/projects/subversion/subversion/bindings/swig/perl/native/blib/arch/auto/SVN/_Core/_Core.so' for module SVN::_Core: /home/bhuvan/projects/subversion/subversion/bindings/swig/perl/native/blib/arch/auto/SVN/_Core/_Core.so: undefined symbol: apr_palloc at /usr/lib/perl/5.8/DynaLoader.pm line 225.
 at /home/bhuvan/projects/subversion/subversion/bindings/swig/perl/native/blib/lib/SVN/Base.pm line 59
BEGIN failed--compilation aborted at /home/bhuvan/projects/subversion/subversion/bindings/swig/perl/native/blib/lib/SVN/Core.pm line 5.
Compilation failed in require at ../../../../../subversion/bindings/swig/perl/native/t/8lock.t line 6.
# Looks like your test died before it could output anything.
dubious
	Test returned status 255 (wstat 65280, 0xff00)
DIED. FAILED tests 1-8
	Failed 8/8 tests, 0.00% okay
Failed Test                       Stat Wstat Total Fail  Failed  List of Failed
-------------------------------------------------------------------------------
../../../../../subversion/binding    7  1792     7    7 100.00%  1-7
../../../../../subversion/binding  255 65280     6   12 200.00%  1-6
../../../../../subversion/binding  255 65280    16   32 200.00%  1-16
../../../../../subversion/binding  255 65280   117  229 195.73%  1-3 5-117
../../../../../subversion/binding  255 65280     6   12 200.00%  1-6
../../../../../subversion/binding  255 65280     2    4 200.00%  1-2
../../../../../subversion/binding  255 65280     3    6 200.00%  1-3
../../../../../subversion/binding  255 65280     6   12 200.00%  1-6
../../../../../subversion/binding  255 65280     1    2 200.00%  1
../../../../../subversion/binding  255 65280     8   16 200.00%  1-8
Failed 10/10 test scripts, 0.00% okay. 171/172 subtests failed, 0.58% okay.
make[1]: *** [test_dynamic] Error 255
make[1]: Leaving directory `/home/bhuvan/projects/subversion/subversion/bindings/swig/perl/native'
make: *** [check-swig-pl] Error 2