rendered paste bodyMicrosoft.VisualBasic.CompilerServices/StringType.cs(902) warning CS0169: The private method 'Microsoft.VisualBasic.CompilerServices.StringType.inBracketText( string, char)' is never used
Compilation succeeded - 25 warning(s)
: ../../class/lib/default/Microsoft.VisualBasic.dll ../../class/mono.snk
make[8]: Entering directory `/usr/src/redhat/BUILD/mono-1.1.7/mcs/class/Microsoft.VisualBasic/fixup'
make all-local
make[9]: Entering directory `/usr/src/redhat/BUILD/mono-1.1.7/mcs/class/Microsoft.VisualBasic/fixup'
MONO_PATH="../../../class/lib/default:$MONO_PATH" /usr/src/redhat/BUILD/mono-1.1.7/runtime/monodis-wrapper ../../../class/lib/default/Microsoft.VisualBasic.dll > default/t1 || { rm -f default/t1; exit 1; }
/bin/sh: line 1: 26647 Segmentation fault MONO_PATH="../../../class/lib/default:$MONO_PATH" /usr/src/redhat/BUILD/mono-1.1.7/runtime/monodis-wrapper ../../../class/lib/default/Microsoft.VisualBasic.dll >default/t1
make[9]: *** [default/Microsoft.VisualBasic.il] Error 1
make[9]: Leaving directory `/usr/src/redhat/BUILD/mono-1.1.7/mcs/class/Microsoft.VisualBasic/fixup'
make[8]: *** [all.real] Error 2
make[8]: Leaving directory `/usr/src/redhat/BUILD/mono-1.1.7/mcs/class/Microsoft.VisualBasic/fixup'
make[7]: *** [all-recursive] Error 1
make[7]: Leaving directory `/usr/src/redhat/BUILD/mono-1.1.7/mcs/class/Microsoft.VisualBasic'
make[6]: *** [all-recursive] Error 1
make[6]: Leaving directory `/usr/src/redhat/BUILD/mono-1.1.7/mcs/class'
make[5]: *** [all-recursive] Error 1
make[5]: Leaving directory `/usr/src/redhat/BUILD/mono-1.1.7/mcs'
make[4]: *** [profile-do--default--all] Error 2
make[4]: Leaving directory `/usr/src/redhat/BUILD/mono-1.1.7/mcs'
make[3]: *** [profiles-do--all] Error 2
make[3]: Leaving directory `/usr/src/redhat/BUILD/mono-1.1.7/mcs'
make[2]: *** [all-local] Error 2
make[2]: Leaving directory `/usr/src/redhat/BUILD/mono-1.1.7/runtime'
make[1]: *** [all-recursive] Error 1
make[1]: Leaving directory `/usr/src/redhat/BUILD/mono-1.1.7'
make: *** [all] Error 2
error: Bad exit status from /var/tmp/rpm-tmp.48661 (%build)