rendered paste bodyThis file contains any messages produced by compilers while
running configure, to aid debugging if configure makes a mistake.
It was created by configure, which was
generated by GNU Autoconf 2.59. Invocation command line was
$ ./configure
## --------- ##
## Platform. ##
## --------- ##
hostname = localhost.localdomain
uname -m = i686
uname -r = 2.6.9-34.0.2.EL
uname -s = Linux
uname -v = #1 Fri Jul 7 19:24:57 CDT 2006
/usr/bin/uname -p = unknown
/bin/uname -X = unknown
/bin/arch = i686
/usr/bin/arch -k = unknown
/usr/convex/getsysinfo = unknown
hostinfo = unknown
/bin/machine = unknown
/usr/bin/oslevel = unknown
/bin/universe = unknown
PATH: /usr/kerberos/sbin
PATH: /usr/kerberos/bin
PATH: /usr/local/sbin
PATH: /usr/local/bin
PATH: /sbin
PATH: /bin
PATH: /usr/sbin
PATH: /usr/bin
PATH: /usr/X11R6/bin
PATH: /root/bin
## ----------- ##
## Core tests. ##
## ----------- ##
configure:1351: checking for a BSD-compatible install
configure:1406: result: /usr/bin/install -c
configure:1417: checking whether build environment is sane
configure:1460: result: yes
configure:1475: checking whether make sets $(MAKE)
configure:1495: result: yes
configure:1527: checking for working aclocal-1.4
configure:1534: result: found
configure:1542: checking for working autoconf
configure:1549: result: found
configure:1557: checking for working automake-1.4
configure:1564: result: found
configure:1572: checking for working autoheader
configure:1579: result: found
configure:1587: checking for working makeinfo
configure:1594: result: found
configure:1615: checking build system type
configure:1633: result: i686-pc-linux-gnu
configure:1641: checking host system type
configure:1655: result: i686-pc-linux-gnu
configure:1768: checking for gcc
configure:1784: found /usr/bin/gcc
configure:1794: result: gcc
configure:2038: checking for C compiler version
configure:2041: gcc --version </dev/null >&5
gcc (GCC) 3.4.5 20051201 (Red Hat 3.4.5-2)
Copyright (C) 2004 Free Software Foundation, Inc.
This is free software; see the source for copying conditions. There is NO
warranty; not even for MERCHANTABILITY or FITNESS FOR A PARTICULAR PURPOSE.
configure:2044: $? = 0
configure:2046: gcc -v </dev/null >&5
Reading specs from /usr/lib/gcc/i386-redhat-linux/3.4.5/specs
Configured with: ../configure --prefix=/usr --mandir=/usr/share/man --infodir=/usr/share/info --enable-shared --enable-threads=posix --disable-checking --with-system-zlib --enable-__cxa_atexit --disable-libunwind-exceptions --enable-java-awt=gtk --host=i386-redhat-linux
Thread model: posix
gcc version 3.4.5 20051201 (Red Hat 3.4.5-2)
configure:2049: $? = 0
configure:2051: gcc -V </dev/null >&5
gcc: `-V' option must have argument
configure:2054: $? = 1
configure:2077: checking for C compiler default output file name
configure:2080: gcc -I/usr/kerberos/include conftest.c >&5
configure:2083: $? = 0
configure:2129: result: a.out
configure:2134: checking whether the C compiler works
configure:2140: ./a.out
configure:2143: $? = 0
configure:2160: result: yes
configure:2167: checking whether we are cross compiling
configure:2169: result: no
configure:2172: checking for suffix of executables
configure:2174: gcc -o conftest -I/usr/kerberos/include conftest.c >&5
configure:2177: $? = 0
configure:2202: result:
configure:2208: checking for suffix of object files
configure:2229: gcc -c -I/usr/kerberos/include conftest.c >&5
configure:2232: $? = 0
configure:2254: result: o
configure:2258: checking whether we are using the GNU C compiler
configure:2282: gcc -c -I/usr/kerberos/include conftest.c >&5
configure:2288: $? = 0
configure:2291: test -z || test ! -s conftest.err
configure:2294: $? = 0
configure:2297: test -s conftest.o
configure:2300: $? = 0
configure:2313: result: yes
configure:2319: checking whether gcc accepts -g
configure:2340: gcc -c -g conftest.c >&5
configure:2346: $? = 0
configure:2349: test -z || test ! -s conftest.err
configure:2352: $? = 0
configure:2355: test -s conftest.o
configure:2358: $? = 0
configure:2369: result: yes
configure:2386: checking for gcc option to accept ANSI C
configure:2456: gcc -c -I/usr/kerberos/include conftest.c >&5
configure:2462: $? = 0
configure:2465: test -z || test ! -s conftest.err
configure:2468: $? = 0
configure:2471: test -s conftest.o
configure:2474: $? = 0
configure:2492: result: none needed
configure:2510: gcc -c -I/usr/kerberos/include conftest.c >&5
conftest.c:2: error: syntax error before "me"
configure:2516: $? = 1
configure: failed program was:
| #ifndef __cplusplus
| choke me
| #endif
configure:2646: checking whether make sets $(MAKE)
configure:2666: result: yes
configure:2716: checking for ranlib
configure:2732: found /usr/bin/ranlib
configure:2743: result: ranlib
configure:2809: checking for library containing socket
configure:2839: gcc -o conftest -I/usr/kerberos/include conftest.c >&5
configure:2845: $? = 0
configure:2848: test -z || test ! -s conftest.err
configure:2851: $? = 0
configure:2854: test -s conftest
configure:2857: $? = 0
configure:2926: result: none required
configure:2933: checking for library containing gethostbyname
configure:2963: gcc -o conftest -I/usr/kerberos/include conftest.c >&5
configure:2969: $? = 0
configure:2972: test -z || test ! -s conftest.err
configure:2975: $? = 0
configure:2978: test -s conftest
configure:2981: $? = 0
configure:3050: result: none required
configure:3057: checking for library containing dlopen
configure:3087: gcc -o conftest -I/usr/kerberos/include conftest.c >&5
/tmp/ccQoxDEh.o(.text+0x1d): In function `main':
: undefined reference to `dlopen'
collect2: ld returned 1 exit status
configure:3093: $? = 1
configure: failed program was:
| /* confdefs.h. */
|
| #define PACKAGE_NAME ""
| #define PACKAGE_TARNAME ""
| #define PACKAGE_VERSION ""
| #define PACKAGE_STRING ""
| #define PACKAGE_BUGREPORT ""
| #define PACKAGE "tor"
| #define VERSION "0.1.1.23"
| #define ENABLE_THREADS 1
| /* end confdefs.h. */
|
| /* Override any gcc2 internal prototype to avoid an error. */
| #ifdef __cplusplus
| extern "C"
| #endif
| /* We use char because int might match the return type of a gcc2
| builtin and then its argument prototype would still apply. */
| char dlopen ();
| int
| main ()
| {
| dlopen ();
| ;
| return 0;
| }
configure:3141: gcc -o conftest -I/usr/kerberos/include conftest.c -ldl >&5
configure:3147: $? = 0
configure:3150: test -z || test ! -s conftest.err
configure:3153: $? = 0
configure:3156: test -s conftest
configure:3159: $? = 0
configure:3174: result: -ldl
configure:3183: checking for library containing pthread_create
configure:3213: gcc -o conftest -I/usr/kerberos/include conftest.c -ldl >&5
/tmp/ccEphFbi.o(.text+0x1d): In function `main':
: undefined reference to `pthread_create'
collect2: ld returned 1 exit status
configure:3219: $? = 1
configure: failed program was:
| /* confdefs.h. */
|
| #define PACKAGE_NAME ""
| #define PACKAGE_TARNAME ""
| #define PACKAGE_VERSION ""
| #define PACKAGE_STRING ""
| #define PACKAGE_BUGREPORT ""
| #define PACKAGE "tor"
| #define VERSION "0.1.1.23"
| #define ENABLE_THREADS 1
| /* end confdefs.h. */
|
| /* Override any gcc2 internal prototype to avoid an error. */
| #ifdef __cplusplus
| extern "C"
| #endif
| /* We use char because int might match the return type of a gcc2
| builtin and then its argument prototype would still apply. */
| char pthread_create ();
| int
| main ()
| {
| pthread_create ();
| ;
| return 0;
| }
configure:3267: gcc -o conftest -I/usr/kerberos/include conftest.c -lpthread -ldl >&5
configure:3273: $? = 0
configure:3276: test -z || test ! -s conftest.err
configure:3279: $? = 0
configure:3282: test -s conftest
configure:3285: $? = 0
configure:3300: result: -lpthread
configure:3307: checking for library containing pthread_detach
configure:3337: gcc -o conftest -I/usr/kerberos/include conftest.c -lpthread -ldl >&5
configure:3343: $? = 0
configure:3346: test -z || test ! -s conftest.err
configure:3349: $? = 0
configure:3352: test -s conftest
configure:3355: $? = 0
configure:3424: result: none required
configure:3434: checking for libevent directory
configure:3483: gcc -o conftest -I/usr/kerberos/include conftest.c -lpthread -ldl -levent >&5
configure:3489: $? = 0
configure:3492: test -z || test ! -s conftest.err
configure:3495: $? = 0
configure:3498: test -s conftest
configure:3501: $? = 0
configure:3532: result: (system)
configure:3550: checking whether we need extra options to link libevent
configure:3580: gcc -o conftest -I/usr/kerberos/include conftest.c -lpthread -ldl -levent >&5
configure:3583: $? = 0
configure:3585: ./conftest
./conftest: error while loading shared libraries: libevent-1.1a.so.1: cannot open shared object file: No such file or directory
configure:3588: $? = 127
configure: program exited with status 127
configure: failed program was:
| /* confdefs.h. */
|
| #define PACKAGE_NAME ""
| #define PACKAGE_TARNAME ""
| #define PACKAGE_VERSION ""
| #define PACKAGE_STRING ""
| #define PACKAGE_BUGREPORT ""
| #define PACKAGE "tor"
| #define VERSION "0.1.1.23"
| #define ENABLE_THREADS 1
| /* end confdefs.h. */
| void *event_init(void);
| int main(int c, char **v) {
| event_init(); return 0;
| }
configure:3580: gcc -o conftest -I/usr/kerberos/include -Wl,-R conftest.c -lpthread -ldl -levent >&5
configure:3583: $? = 0
configure:3585: ./conftest
./conftest: error while loading shared libraries: libevent-1.1a.so.1: cannot open shared object file: No such file or directory
configure:3588: $? = 127
configure: program exited with status 127
configure: failed program was:
| /* confdefs.h. */
|
| #define PACKAGE_NAME ""
| #define PACKAGE_TARNAME ""
| #define PACKAGE_VERSION ""
| #define PACKAGE_STRING ""
| #define PACKAGE_BUGREPORT ""
| #define PACKAGE "tor"
| #define VERSION "0.1.1.23"
| #define ENABLE_THREADS 1
| /* end confdefs.h. */
| void *event_init(void);
| int main(int c, char **v) {
| event_init(); return 0;
| }
configure:3580: gcc -o conftest -I/usr/kerberos/include -R conftest.c -lpthread -ldl -levent >&5
gcc: unrecognized option `-R'
configure:3583: $? = 0
configure:3585: ./conftest
./conftest: error while loading shared libraries: libevent-1.1a.so.1: cannot open shared object file: No such file or directory
configure:3588: $? = 127
configure: program exited with status 127
configure: failed program was:
| /* confdefs.h. */
|
| #define PACKAGE_NAME ""
| #define PACKAGE_TARNAME ""
| #define PACKAGE_VERSION ""
| #define PACKAGE_STRING ""
| #define PACKAGE_BUGREPORT ""
| #define PACKAGE "tor"
| #define VERSION "0.1.1.23"
| #define ENABLE_THREADS 1
| /* end confdefs.h. */
| void *event_init(void);
| int main(int c, char **v) {
| event_init(); return 0;
| }
configure:3612: error: Found linkable libevent in (system), but it doesn't run, even with -R. Maybe specify another using --with-libevent-dir?
## ---------------- ##
## Cache variables. ##
## ---------------- ##
ac_cv_build=i686-pc-linux-gnu
ac_cv_build_alias=i686-pc-linux-gnu
ac_cv_c_compiler_gnu=yes
ac_cv_env_CC_set=
ac_cv_env_CC_value=
ac_cv_env_CFLAGS_set=
ac_cv_env_CFLAGS_value=
ac_cv_env_CPPFLAGS_set=
ac_cv_env_CPPFLAGS_value=
ac_cv_env_CPP_set=
ac_cv_env_CPP_value=
ac_cv_env_LDFLAGS_set=
ac_cv_env_LDFLAGS_value=
ac_cv_env_build_alias_set=
ac_cv_env_build_alias_value=
ac_cv_env_host_alias_set=
ac_cv_env_host_alias_value=
ac_cv_env_target_alias_set=
ac_cv_env_target_alias_value=
ac_cv_exeext=
ac_cv_host=i686-pc-linux-gnu
ac_cv_host_alias=i686-pc-linux-gnu
ac_cv_libevent_dir='(system)'
ac_cv_objext=o
ac_cv_path_install='/usr/bin/install -c'
ac_cv_prog_ac_ct_CC=gcc
ac_cv_prog_ac_ct_RANLIB=ranlib
ac_cv_prog_cc_g=yes
ac_cv_prog_cc_stdc=
ac_cv_prog_make_make_set=yes
ac_cv_search_dlopen=-ldl
ac_cv_search_gethostbyname='none required'
ac_cv_search_pthread_create=-lpthread
ac_cv_search_pthread_detach='none required'
ac_cv_search_socket='none required'
## ----------------- ##
## Output variables. ##
## ----------------- ##
ACLOCAL='aclocal-1.4'
AUTOCONF='autoconf'
AUTOHEADER='autoheader'
AUTOMAKE='automake-1.4'
BINDIR=''
CC='gcc'
CFLAGS=' -I/usr/kerberos/include'
CONFDIR=''
CPP=''
CPPFLAGS=''
DEFS=''
ECHO_C=''
ECHO_N='-n'
ECHO_T=''
EGREP=''
EXEEXT=''
INSTALL_DATA='${INSTALL} -m 644'
INSTALL_PROGRAM='${INSTALL}'
INSTALL_SCRIPT='${INSTALL}'
LDFLAGS='-R '
LIBOBJS=''
LIBS='-lpthread -ldl -levent'
LOCALSTATEDIR=''
LOGFACILITY=''
LTLIBOBJS=''
MAKEINFO='makeinfo'
OBJEXT='o'
PACKAGE='tor'
PACKAGE_BUGREPORT=''
PACKAGE_NAME=''
PACKAGE_STRING=''
PACKAGE_TARNAME=''
PACKAGE_VERSION=''
PATH_SEPARATOR=':'
RANLIB='ranlib'
SET_MAKE=''
SHELL='/bin/sh'
TORGROUP='_tor'
TORUSER='_tor'
VERSION='0.1.1.23'
ac_ct_CC='gcc'
ac_ct_RANLIB='ranlib'
bindir='${exec_prefix}/bin'
build='i686-pc-linux-gnu'
build_alias=''
build_cpu='i686'
build_os='linux-gnu'
build_vendor='pc'
datadir='${prefix}/share'
exec_prefix='NONE'
host='i686-pc-linux-gnu'
host_alias=''
host_cpu='i686'
host_os='linux-gnu'
host_vendor='pc'
includedir='${prefix}/include'
infodir='${prefix}/info'
libdir='${exec_prefix}/lib'
libexecdir='${exec_prefix}/libexec'
localstatedir='${prefix}/var'
mandir='${prefix}/man'
oldincludedir='/usr/include'
prefix='NONE'
program_transform_name='s,x,x,'
sbindir='${exec_prefix}/sbin'
sharedstatedir='${prefix}/com'
sysconfdir='${prefix}/etc'
target_alias=''
## ----------- ##
## confdefs.h. ##
## ----------- ##
#define ENABLE_THREADS 1
#define PACKAGE "tor"
#define PACKAGE_BUGREPORT ""
#define PACKAGE_NAME ""
#define PACKAGE_STRING ""
#define PACKAGE_TARNAME ""
#define PACKAGE_VERSION ""
#define VERSION "0.1.1.23"
configure: exit 1