All pastes #113937 Raw Edit

error while making p

public text v1 · immutable
·published 2006-08-03 20:44 UTC
rendered paste body
/bin/sh /root/php-5.1.2/libtool --silent --preserve-dup-deps --mode=compile gcc -I/root/php-5.1.2/ext/gd/libgd -DHAVE_LIBPNG -DHAVE_LIBJPEG -DHAVE_LIBFREETYPE -Iext/gd/ -I/root/php-5.1.2/ext/gd/ -DPHP_ATOM_INC -I/root/php-5.1.2/include -I/root/php-5.1.2/main -I/root/php-5.1.2 -I/usr/include/libxml2 -I/root/php-5.1.2/ext/date/lib -I/usr/local/include -I/usr/local/include/freetype2 -I/usr/local/pgsql/include -I/root/php-5.1.2/TSRM -I/root/php-5.1.2/Zend    -I/usr/include -g -O2  -prefer-non-pic -c /root/php-5.1.2/ext/gd/libgd/gd_jpeg.c -o ext/gd/libgd/gd_jpeg.lo
/root/php-5.1.2/ext/gd/libgd/gd_jpeg.c:38:21: error: jpeglib.h: No such file or directory
/root/php-5.1.2/ext/gd/libgd/gd_jpeg.c:39:20: error: jerror.h: No such file or directory
/root/php-5.1.2/ext/gd/libgd/gd_jpeg.c:49: error: expected ')' before 'cinfo'
/root/php-5.1.2/ext/gd/libgd/gd_jpeg.c:96: error: expected ')' before 'cinfo'
/root/php-5.1.2/ext/gd/libgd/gd_jpeg.c: In function 'php_gd_gdImageJpegCtx':
/root/php-5.1.2/ext/gd/libgd/gd_jpeg.c:100: error: storage size of 'cinfo' isn't known
/root/php-5.1.2/ext/gd/libgd/gd_jpeg.c:101: error: storage size of 'jerr' isn't known
/root/php-5.1.2/ext/gd/libgd/gd_jpeg.c:104: error: expected '=', ',', ';', 'asm' or '__attribute__' before 'row'
/root/php-5.1.2/ext/gd/libgd/gd_jpeg.c:104: error: 'row' undeclared (first use in this function)
/root/php-5.1.2/ext/gd/libgd/gd_jpeg.c:104: error: (Each undeclared identifier is reported only once
/root/php-5.1.2/ext/gd/libgd/gd_jpeg.c:104: error: for each function it appears in.)
/root/php-5.1.2/ext/gd/libgd/gd_jpeg.c:105: error: 'JSAMPROW' undeclared (first use in this function)
/root/php-5.1.2/ext/gd/libgd/gd_jpeg.c:107: error: 'JDIMENSION' undeclared (first use in this function)
/root/php-5.1.2/ext/gd/libgd/gd_jpeg.c:107: error: expected ';' before 'nlines'
/root/php-5.1.2/ext/gd/libgd/gd_jpeg.c:123: error: 'fatal_jpeg_error' undeclared (first use in this function)
/root/php-5.1.2/ext/gd/libgd/gd_jpeg.c:130: error: 'JCS_RGB' undeclared (first use in this function)
/root/php-5.1.2/ext/gd/libgd/gd_jpeg.c:133: error: 'TRUE' undeclared (first use in this function)
/root/php-5.1.2/ext/gd/libgd/gd_jpeg.c:143: error: expected ';' before '_safe_emalloc'
/root/php-5.1.2/ext/gd/libgd/gd_jpeg.c:144: error: 'JSAMPLE' undeclared (first use in this function)
/root/php-5.1.2/ext/gd/libgd/gd_jpeg.c:145: error: 'rowptr' undeclared (first use in this function)
/root/php-5.1.2/ext/gd/libgd/gd_jpeg.c:150: error: 'JPEG_LIB_VERSION' undeclared (first use in this function)
/root/php-5.1.2/ext/gd/libgd/gd_jpeg.c:154: error: 'JPEG_COM' undeclared (first use in this function)
/root/php-5.1.2/ext/gd/libgd/gd_jpeg.c:171: error: 'nlines' undeclared (first use in this function)
/root/php-5.1.2/ext/gd/libgd/gd_jpeg.c:194:2: error: #error IJG JPEG library BITS_IN_JSAMPLE value must be 8 or 12
/root/php-5.1.2/ext/gd/libgd/gd_jpeg.c: At top level:
/root/php-5.1.2/ext/gd/libgd/gd_jpeg.c:230: error: expected ')' before 'cinfo'
/root/php-5.1.2/ext/gd/libgd/gd_jpeg.c: In function 'php_gd_gdImageCreateFromJpegCtx':
/root/php-5.1.2/ext/gd/libgd/gd_jpeg.c:240: error: storage size of 'cinfo' isn't known
/root/php-5.1.2/ext/gd/libgd/gd_jpeg.c:241: error: storage size of 'jerr' isn't known
/root/php-5.1.2/ext/gd/libgd/gd_jpeg.c:244: error: expected '=', ',', ';', 'asm' or '__attribute__' before 'row'
/root/php-5.1.2/ext/gd/libgd/gd_jpeg.c:244: error: 'row' undeclared (first use in this function)
/root/php-5.1.2/ext/gd/libgd/gd_jpeg.c:246: error: 'JSAMPROW' undeclared (first use in this function)
/root/php-5.1.2/ext/gd/libgd/gd_jpeg.c:246: error: expected ';' before 'rowptr'
/root/php-5.1.2/ext/gd/libgd/gd_jpeg.c:249: error: 'JDIMENSION' undeclared (first use in this function)
/root/php-5.1.2/ext/gd/libgd/gd_jpeg.c:249: error: expected ';' before 'nrows'
/root/php-5.1.2/ext/gd/libgd/gd_jpeg.c:263: error: 'im' undeclared (first use in this function)
/root/php-5.1.2/ext/gd/libgd/gd_jpeg.c:269: error: 'fatal_jpeg_error' undeclared (first use in this function)
/root/php-5.1.2/ext/gd/libgd/gd_jpeg.c:276: error: 'JPEG_APP0' undeclared (first use in this function)
/root/php-5.1.2/ext/gd/libgd/gd_jpeg.c:278: error: 'TRUE' undeclared (first use in this function)
/root/php-5.1.2/ext/gd/libgd/gd_jpeg.c:279: error: 'JPEG_HEADER_OK' undeclared (first use in this function)
/root/php-5.1.2/ext/gd/libgd/gd_jpeg.c:300: error: 'JCS_CMYK' undeclared (first use in this function)
/root/php-5.1.2/ext/gd/libgd/gd_jpeg.c:300: error: 'JCS_YCCK' undeclared (first use in this function)
/root/php-5.1.2/ext/gd/libgd/gd_jpeg.c:303: error: 'JCS_RGB' undeclared (first use in this function)
/root/php-5.1.2/ext/gd/libgd/gd_jpeg.c:330: error: 'jpeg_saved_marker_ptr' undeclared (first use in this function)
/root/php-5.1.2/ext/gd/libgd/gd_jpeg.c:330: error: expected ';' before 'marker'
/root/php-5.1.2/ext/gd/libgd/gd_jpeg.c:336: error: 'marker' undeclared (first use in this function)
/root/php-5.1.2/ext/gd/libgd/gd_jpeg.c:354: error: 'JSAMPLE' undeclared (first use in this function)
/root/php-5.1.2/ext/gd/libgd/gd_jpeg.c:356: error: 'rowptr' undeclared (first use in this function)
/root/php-5.1.2/ext/gd/libgd/gd_jpeg.c:360: error: expected '=', ',', ';', 'asm' or '__attribute__' before 'currow'
/root/php-5.1.2/ext/gd/libgd/gd_jpeg.c:360: error: 'currow' undeclared (first use in this function)
/root/php-5.1.2/ext/gd/libgd/gd_jpeg.c:362: error: 'nrows' undeclared (first use in this function)
/root/php-5.1.2/ext/gd/libgd/gd_jpeg.c:367: error: 'tpix' undeclared (first use in this function)
/root/php-5.1.2/ext/gd/libgd/gd_jpeg.c:373: error: expected '=', ',', ';', 'asm' or '__attribute__' before 'currow'
/root/php-5.1.2/ext/gd/libgd/gd_jpeg.c: At top level:
/root/php-5.1.2/ext/gd/libgd/gd_jpeg.c:446: error: field 'pub' has incomplete type
/root/php-5.1.2/ext/gd/libgd/gd_jpeg.c:462: error: expected ')' before 'cinfo'
/root/php-5.1.2/ext/gd/libgd/gd_jpeg.c:509: error: expected ')' before 'cinfo'
/root/php-5.1.2/ext/gd/libgd/gd_jpeg.c:563: error: expected ')' before 'cinfo'
/root/php-5.1.2/ext/gd/libgd/gd_jpeg.c:602: error: expected ')' before 'cinfo'
/root/php-5.1.2/ext/gd/libgd/gd_jpeg.c:617: error: expected ')' before 'cinfo'
/root/php-5.1.2/ext/gd/libgd/gd_jpeg.c:651: error: field 'pub' has incomplete type
/root/php-5.1.2/ext/gd/libgd/gd_jpeg.c:665: error: expected ')' before 'cinfo'
/root/php-5.1.2/ext/gd/libgd/gd_jpeg.c:700: error: expected ')' before 'cinfo'
/root/php-5.1.2/ext/gd/libgd/gd_jpeg.c:724: error: expected ')' before 'cinfo'
/root/php-5.1.2/ext/gd/libgd/gd_jpeg.c:742: error: expected ')' before 'cinfo'
make: *** [ext/gd/libgd/gd_jpeg.lo] Error 1