rendered paste bodyThis file contains any messages produced by compilers while
running configure, to aid debugging if configure makes a mistake.
It was created by configure, which was
generated by GNU Autoconf 2.59. Invocation command line was
$ ./configure
## --------- ##
## Platform. ##
## --------- ##
hostname = piko.hoomaha.net
uname -m = i686
uname -r = 2.6.10-1.760_FC3smp
uname -s = Linux
uname -v = #1 SMP Wed Feb 2 00:23:04 EST 2005
/usr/bin/uname -p = unknown
/bin/uname -X = unknown
/bin/arch = i686
/usr/bin/arch -k = unknown
/usr/convex/getsysinfo = unknown
hostinfo = unknown
/bin/machine = unknown
/usr/bin/oslevel = unknown
/bin/universe = unknown
PATH: /usr/kerberos/bin
PATH: /usr/local/bin
PATH: /bin
PATH: /usr/bin
PATH: /usr/X11R6/bin
PATH: /usr/lib/jre/bin
## ----------- ##
## Core tests. ##
## ----------- ##
configure:1383: checking build system type
configure:1401: result: i686-pc-linux-gnu
configure:1409: checking host system type
configure:1423: result: i686-pc-linux-gnu
configure:1431: checking target system type
configure:1445: result: i686-pc-linux-gnu
configure:1473: checking for a BSD-compatible install
configure:1528: result: /usr/bin/install -c
configure:1539: checking whether build environment is sane
configure:1582: result: yes
configure:1647: checking for gawk
configure:1663: found /bin/gawk
configure:1673: result: gawk
configure:1683: checking whether make sets $(MAKE)
configure:1703: result: yes
configure:1886: checking for whoami
configure:1902: found /usr/bin/whoami
configure:1913: result: yes
configure:1980: checking whether make sets $(MAKE)
configure:2000: result: yes
configure:2055: checking for gcc
configure:2071: found /usr/bin/gcc
configure:2081: result: gcc
configure:2325: checking for C compiler version
configure:2328: gcc --version </dev/null >&5
gcc (GCC) 3.4.3 20050227 (Red Hat 3.4.3-22.fc3)
Copyright (C) 2004 Free Software Foundation, Inc.
This is free software; see the source for copying conditions. There is NO
warranty; not even for MERCHANTABILITY or FITNESS FOR A PARTICULAR PURPOSE.
configure:2331: $? = 0
configure:2333: gcc -v </dev/null >&5
Reading specs from /usr/lib/gcc/i386-redhat-linux/3.4.3/specs
Configured with: ../configure --prefix=/usr --mandir=/usr/share/man --infodir=/usr/share/info --enable-shared --enable-threads=posix --disable-checking --with-system-zlib --enable-__cxa_atexit --disable-libunwind-exceptions --enable-java-awt=gtk --host=i386-redhat-linux
Thread model: posix
gcc version 3.4.3 20050227 (Red Hat 3.4.3-22.fc3)
configure:2336: $? = 0
configure:2338: gcc -V </dev/null >&5
gcc: `-V' option must have argument
configure:2341: $? = 1
configure:2364: checking for C compiler default output file name
configure:2367: gcc conftest.c >&5
configure:2370: $? = 0
configure:2416: result: a.out
configure:2421: checking whether the C compiler works
configure:2427: ./a.out
configure:2430: $? = 0
configure:2447: result: yes
configure:2454: checking whether we are cross compiling
configure:2456: result: no
configure:2459: checking for suffix of executables
configure:2461: gcc -o conftest conftest.c >&5
configure:2464: $? = 0
configure:2489: result:
configure:2495: checking for suffix of object files
configure:2516: gcc -c conftest.c >&5
configure:2519: $? = 0
configure:2541: result: o
configure:2545: checking whether we are using the GNU C compiler
configure:2569: gcc -c conftest.c >&5
configure:2575: $? = 0
configure:2579: test -z
|| test ! -s conftest.err
configure:2582: $? = 0
configure:2585: test -s conftest.o
configure:2588: $? = 0
configure:2601: result: yes
configure:2607: checking whether gcc accepts -g
configure:2628: gcc -c -g conftest.c >&5
configure:2634: $? = 0
configure:2638: test -z
|| test ! -s conftest.err
configure:2641: $? = 0
configure:2644: test -s conftest.o
configure:2647: $? = 0
configure:2658: result: yes
configure:2675: checking for gcc option to accept ANSI C
configure:2745: gcc -c -g -O2 conftest.c >&5
configure:2751: $? = 0
configure:2755: test -z
|| test ! -s conftest.err
configure:2758: $? = 0
configure:2761: test -s conftest.o
configure:2764: $? = 0
configure:2782: result: none needed
configure:2800: gcc -c -g -O2 conftest.c >&5
conftest.c:2: error: syntax error before "me"
configure:2806: $? = 1
configure: failed program was:
| #ifndef __cplusplus
| choke me
| #endif
configure:2950: checking for style of include used by make
configure:2978: result: GNU
configure:3006: checking dependency style of gcc
configure:3096: result: gcc3
configure:3165: checking for g++
configure:3181: found /usr/bin/g++
configure:3191: result: g++
configure:3207: checking for C++ compiler version
configure:3210: g++ --version </dev/null >&5
g++ (GCC) 3.4.3 20050227 (Red Hat 3.4.3-22.fc3)
Copyright (C) 2004 Free Software Foundation, Inc.
This is free software; see the source for copying conditions. There is NO
warranty; not even for MERCHANTABILITY or FITNESS FOR A PARTICULAR PURPOSE.
configure:3213: $? = 0
configure:3215: g++ -v </dev/null >&5
Reading specs from /usr/lib/gcc/i386-redhat-linux/3.4.3/specs
Configured with: ../configure --prefix=/usr --mandir=/usr/share/man --infodir=/usr/share/info --enable-shared --enable-threads=posix --disable-checking --with-system-zlib --enable-__cxa_atexit --disable-libunwind-exceptions --enable-java-awt=gtk --host=i386-redhat-linux
Thread model: posix
gcc version 3.4.3 20050227 (Red Hat 3.4.3-22.fc3)
configure:3218: $? = 0
configure:3220: g++ -V </dev/null >&5
g++: `-V' option must have argument
configure:3223: $? = 1
configure:3226: checking whether we are using the GNU C++ compiler
configure:3250: g++ -c conftest.cc >&5
configure:3256: $? = 0
configure:3260: test -z
|| test ! -s conftest.err
configure:3263: $? = 0
configure:3266: test -s conftest.o
configure:3269: $? = 0
configure:3282: result: yes
configure:3288: checking whether g++ accepts -g
configure:3309: g++ -c -g conftest.cc >&5
configure:3315: $? = 0
configure:3319: test -z
|| test ! -s conftest.err
configure:3322: $? = 0
configure:3325: test -s conftest.o
configure:3328: $? = 0
configure:3339: result: yes
configure:3381: g++ -c -g -O2 conftest.cc >&5
configure:3387: $? = 0
configure:3391: test -z
|| test ! -s conftest.err
configure:3394: $? = 0
configure:3397: test -s conftest.o
configure:3400: $? = 0
configure:3426: g++ -c -g -O2 conftest.cc >&5
conftest.cc: In function `int main()':
conftest.cc:18: error: `exit' undeclared (first use this function)
conftest.cc:18: error: (Each undeclared identifier is reported only once for each function it appears in.)
configure:3432: $? = 1
configure: failed program was:
| /* confdefs.h. */
|
| #define PACKAGE_NAME ""
| #define PACKAGE_TARNAME ""
| #define PACKAGE_VERSION ""
| #define PACKAGE_STRING ""
| #define PACKAGE_BUGREPORT ""
| #define PACKAGE "bzflag"
| #define VERSION "2.0.3.20050510"
| #define BZ_BUILD_OS "linux-gnu"
| #define BZ_BUILD_USER "wili"
| #define BUILD_REGEX 1
| /* end confdefs.h. */
|
| int
| main ()
| {
| exit (42);
| ;
| return 0;
| }
configure:3381: g++ -c -g -O2 conftest.cc >&5
configure:3387: $? = 0
configure:3391: test -z
|| test ! -s conftest.err
configure:3394: $? = 0
configure:3397: test -s conftest.o
configure:3400: $? = 0
configure:3426: g++ -c -g -O2 conftest.cc >&5
configure:3432: $? = 0
configure:3436: test -z
|| test ! -s conftest.err
configure:3439: $? = 0
configure:3442: test -s conftest.o
configure:3445: $? = 0
configure:3470: checking dependency style of g++
configure:3560: result: gcc3
configure:3580: checking for ccache
configure:3613: result: no
configure:3664: checking for windres
configure:3691: result: :
configure:3762: checking whether ln -s works
configure:3766: result: yes
configure:3814: checking for ranlib
configure:3830: found /usr/bin/ranlib
configure:3841: result: ranlib
configure:3855: checking for pod2man
configure:3871: found /usr/bin/pod2man
configure:3882: result: yes
configure:3906: checking for ar
configure:3922: found /usr/bin/ar
configure:3932: result: ar
configure:3941: checking for compress in -lz
configure:3971: gcc -o conftest -g -O2 conftest.c -lz >&5
configure:3977: $? = 0
configure:3981: test -z
|| test ! -s conftest.err
configure:3984: $? = 0
configure:3987: test -s conftest
configure:3990: $? = 0
configure:4003: result: yes
configure:4022: checking for ares_init in -lcares
configure:4052: gcc -o conftest -g -O2 conftest.c -lcares >&5
configure:4058: $? = 0
configure:4062: test -z
|| test ! -s conftest.err
configure:4065: $? = 0
configure:4068: test -s conftest
configure:4071: $? = 0
configure:4084: result: yes
configure:4122: checking for curl >= 7.10.0
configure:4132: result: 7.12.3
configure:4231: checking for artificial intelligence for bz's robots
configure:4233: result: not found
configure:4242: checking how to run the C preprocessor
configure:4277: gcc -E conftest.c
configure:4283: $? = 0
configure:4315: gcc -E conftest.c
conftest.c:18:28: ac_nonexistent.h: No such file or directory
configure:4321: $? = 1
configure: failed program was:
| /* confdefs.h. */
|
| #define PACKAGE_NAME ""
| #define PACKAGE_TARNAME ""
| #define PACKAGE_VERSION ""
| #define PACKAGE_STRING ""
| #define PACKAGE_BUGREPORT ""
| #define PACKAGE "bzflag"
| #define VERSION "2.0.3.20050510"
| #define BZ_BUILD_OS "linux-gnu"
| #define BZ_BUILD_USER "wili"
| #define BUILD_REGEX 1
| #ifdef __cplusplus
| extern "C" void std::exit (int) throw (); using std::exit;
| #endif
| #define HAVE_CURL 1
| /* end confdefs.h. */
| #include <ac_nonexistent.h>
configure:4360: result: gcc -E
configure:4384: gcc -E conftest.c
configure:4390: $? = 0
configure:4422: gcc -E conftest.c
conftest.c:18:28: ac_nonexistent.h: No such file or directory
configure:4428: $? = 1
configure: failed program was:
| /* confdefs.h. */
|
| #define PACKAGE_NAME ""
| #define PACKAGE_TARNAME ""
| #define PACKAGE_VERSION ""
| #define PACKAGE_STRING ""
| #define PACKAGE_BUGREPORT ""
| #define PACKAGE "bzflag"
| #define VERSION "2.0.3.20050510"
| #define BZ_BUILD_OS "linux-gnu"
| #define BZ_BUILD_USER "wili"
| #define BUILD_REGEX 1
| #ifdef __cplusplus
| extern "C" void std::exit (int) throw (); using std::exit;
| #endif
| #define HAVE_CURL 1
| /* end confdefs.h. */
| #include <ac_nonexistent.h>
configure:4472: checking for egrep
configure:4482: result: grep -E
configure:4487: checking for ANSI C header files
configure:4512: gcc -c -g -O2 conftest.c >&5
configure:4518: $? = 0
configure:4522: test -z
|| test ! -s conftest.err
configure:4525: $? = 0
configure:4528: test -s conftest.o
configure:4531: $? = 0
configure:4620: gcc -o conftest -g -O2 conftest.c >&5
configure:4623: $? = 0
configure:4625: ./conftest
configure:4628: $? = 0
configure:4643: result: yes
configure:4676: checking for sys/types.h
configure:4692: g++ -c -g -O2 conftest.cc >&5
configure:4698: $? = 0
configure:4702: test -z
|| test ! -s conftest.err
configure:4705: $? = 0
configure:4708: test -s conftest.o
configure:4711: $? = 0
configure:4722: result: yes
configure:4676: checking for sys/stat.h
configure:4692: g++ -c -g -O2 conftest.cc >&5
configure:4698: $? = 0
configure:4702: test -z
|| test ! -s conftest.err
configure:4705: $? = 0
configure:4708: test -s conftest.o
configure:4711: $? = 0
configure:4722: result: yes
configure:4676: checking for stdlib.h
configure:4692: g++ -c -g -O2 conftest.cc >&5
configure:4698: $? = 0
configure:4702: test -z
|| test ! -s conftest.err
configure:4705: $? = 0
configure:4708: test -s conftest.o
configure:4711: $? = 0
configure:4722: result: yes
configure:4676: checking for string.h
configure:4692: g++ -c -g -O2 conftest.cc >&5
configure:4698: $? = 0
configure:4702: test -z
|| test ! -s conftest.err
configure:4705: $? = 0
configure:4708: test -s conftest.o
configure:4711: $? = 0
configure:4722: result: yes
configure:4676: checking for memory.h
configure:4692: g++ -c -g -O2 conftest.cc >&5
configure:4698: $? = 0
configure:4702: test -z
|| test ! -s conftest.err
configure:4705: $? = 0
configure:4708: test -s conftest.o
configure:4711: $? = 0
configure:4722: result: yes
configure:4676: checking for strings.h
configure:4692: g++ -c -g -O2 conftest.cc >&5
configure:4698: $? = 0
configure:4702: test -z
|| test ! -s conftest.err
configure:4705: $? = 0
configure:4708: test -s conftest.o
configure:4711: $? = 0
configure:4722: result: yes
configure:4676: checking for inttypes.h
configure:4692: g++ -c -g -O2 conftest.cc >&5
configure:4698: $? = 0
configure:4702: test -z
|| test ! -s conftest.err
configure:4705: $? = 0
configure:4708: test -s conftest.o
configure:4711: $? = 0
configure:4722: result: yes
configure:4676: checking for stdint.h
configure:4692: g++ -c -g -O2 conftest.cc >&5
configure:4698: $? = 0
configure:4702: test -z
|| test ! -s conftest.err
configure:4705: $? = 0
configure:4708: test -s conftest.o
configure:4711: $? = 0
configure:4722: result: yes
configure:4676: checking for unistd.h
configure:4692: g++ -c -g -O2 conftest.cc >&5
configure:4698: $? = 0
configure:4702: test -z
|| test ! -s conftest.err
configure:4705: $? = 0
configure:4708: test -s conftest.o
configure:4711: $? = 0
configure:4722: result: yes
configure:4739: checking how to run the C++ preprocessor
configure:4770: g++ -E conftest.cc
configure:4776: $? = 0
configure:4808: g++ -E conftest.cc
conftest.cc:28:28: ac_nonexistent.h: No such file or directory
configure:4814: $? = 1
configure: failed program was:
| /* confdefs.h. */
|
| #define PACKAGE_NAME ""
| #define PACKAGE_TARNAME ""
| #define PACKAGE_VERSION ""
| #define PACKAGE_STRING ""
| #define PACKAGE_BUGREPORT ""
| #define PACKAGE "bzflag"
| #define VERSION "2.0.3.20050510"
| #define BZ_BUILD_OS "linux-gnu"
| #define BZ_BUILD_USER "wili"
| #define BUILD_REGEX 1
| #ifdef __cplusplus
| extern "C" void std::exit (int) throw (); using std::exit;
| #endif
| #define HAVE_CURL 1
| #define STDC_HEADERS 1
| #define HAVE_SYS_TYPES_H 1
| #define HAVE_SYS_STAT_H 1
| #define HAVE_STDLIB_H 1
| #define HAVE_STRING_H 1
| #define HAVE_MEMORY_H 1
| #define HAVE_STRINGS_H 1
| #define HAVE_INTTYPES_H 1
| #define HAVE_STDINT_H 1
| #define HAVE_UNISTD_H 1
| /* end confdefs.h. */
| #include <ac_nonexistent.h>
configure:4853: result: g++ -E
configure:4877: g++ -E conftest.cc
configure:4883: $? = 0
configure:4915: g++ -E conftest.cc
conftest.cc:28:28: ac_nonexistent.h: No such file or directory
configure:4921: $? = 1
configure: failed program was:
| /* confdefs.h. */
|
| #define PACKAGE_NAME ""
| #define PACKAGE_TARNAME ""
| #define PACKAGE_VERSION ""
| #define PACKAGE_STRING ""
| #define PACKAGE_BUGREPORT ""
| #define PACKAGE "bzflag"
| #define VERSION "2.0.3.20050510"
| #define BZ_BUILD_OS "linux-gnu"
| #define BZ_BUILD_USER "wili"
| #define BUILD_REGEX 1
| #ifdef __cplusplus
| extern "C" void std::exit (int) throw (); using std::exit;
| #endif
| #define HAVE_CURL 1
| #define STDC_HEADERS 1
| #define HAVE_SYS_TYPES_H 1
| #define HAVE_SYS_STAT_H 1
| #define HAVE_STDLIB_H 1
| #define HAVE_STRING_H 1
| #define HAVE_MEMORY_H 1
| #define HAVE_STRINGS_H 1
| #define HAVE_INTTYPES_H 1
| #define HAVE_STDINT_H 1
| #define HAVE_UNISTD_H 1
| /* end confdefs.h. */
| #include <ac_nonexistent.h>
configure:4985: checking cstdlib usability
configure:4997: g++ -c -g -O2 conftest.cc >&5
configure:5003: $? = 0
configure:5007: test -z
|| test ! -s conftest.err
configure:5010: $? = 0
configure:5013: test -s conftest.o
configure:5016: $? = 0
configure:5026: result: yes
configure:5030: checking cstdlib presence
configure:5040: g++ -E conftest.cc
configure:5046: $? = 0
configure:5066: result: yes
configure:5101: checking for cstdlib
configure:5108: result: yes
configure:4985: checking cstdio usability
configure:4997: g++ -c -g -O2 conftest.cc >&5
configure:5003: $? = 0
configure:5007: test -z
|| test ! -s conftest.err
configure:5010: $? = 0
configure:5013: test -s conftest.o
configure:5016: $? = 0
configure:5026: result: yes
configure:5030: checking cstdio presence
configure:5040: g++ -E conftest.cc
configure:5046: $? = 0
configure:5066: result: yes
configure:5101: checking for cstdio
configure:5108: result: yes
configure:4985: checking cstring usability
configure:4997: g++ -c -g -O2 conftest.cc >&5
configure:5003: $? = 0
configure:5007: test -z
|| test ! -s conftest.err
configure:5010: $? = 0
configure:5013: test -s conftest.o
configure:5016: $? = 0
configure:5026: result: yes
configure:5030: checking cstring presence
configure:5040: g++ -E conftest.cc
configure:5046: $? = 0
configure:5066: result: yes
configure:5101: checking for cstring
configure:5108: result: yes
configure:5315: checking GL/glx.h usability
configure:5327: gcc -c -g -O2 conftest.c >&5
configure:5333: $? = 0
configure:5337: test -z
|| test ! -s conftest.err
configure:5340: $? = 0
configure:5343: test -s conftest.o
configure:5346: $? = 0
configure:5356: result: yes
configure:5360: checking GL/glx.h presence
configure:5370: gcc -E conftest.c
configure:5376: $? = 0
configure:5396: result: yes
configure:5431: checking for GL/glx.h
configure:5438: result: yes
configure:5315: checking SDL/SDL.h usability
configure:5327: gcc -c -g -O2 conftest.c >&5
configure:5333: $? = 0
configure:5337: test -z
|| test ! -s conftest.err
configure:5340: $? = 0
configure:5343: test -s conftest.o
configure:5346: $? = 0
configure:5356: result: yes
configure:5360: checking SDL/SDL.h presence
configure:5370: gcc -E conftest.c
configure:5376: $? = 0
configure:5396: result: yes
configure:5431: checking for SDL/SDL.h
configure:5438: result: yes
configure:5315: checking X11/Xlib.h usability
configure:5327: gcc -c -g -O2 conftest.c >&5
configure:5333: $? = 0
configure:5337: test -z
|| test ! -s conftest.err
configure:5340: $? = 0
configure:5343: test -s conftest.o
configure:5346: $? = 0
configure:5356: result: yes
configure:5360: checking X11/Xlib.h presence
configure:5370: gcc -E conftest.c
configure:5376: $? = 0
configure:5396: result: yes
configure:5431: checking for X11/Xlib.h
configure:5438: result: yes
configure:5315: checking bstring.h usability
configure:5327: gcc -c -g -O2 conftest.c >&5
conftest.c:68:21: bstring.h: No such file or directory
configure:5333: $? = 1
configure: failed program was:
| /* confdefs.h. */
|
| #define PACKAGE_NAME ""
| #define PACKAGE_TARNAME ""
| #define PACKAGE_VERSION ""
| #define PACKAGE_STRING ""
| #define PACKAGE_BUGREPORT ""
| #define PACKAGE "bzflag"
| #define VERSION "2.0.3.20050510"
| #define BZ_BUILD_OS "linux-gnu"
| #define BZ_BUILD_USER "wili"
| #define BUILD_REGEX 1
| #ifdef __cplusplus
| extern "C" void std::exit (int) throw (); using std::exit;
| #endif
| #define HAVE_CURL 1
| #define STDC_HEADERS 1
| #define HAVE_SYS_TYPES_H 1
| #define HAVE_SYS_STAT_H 1
| #define HAVE_STDLIB_H 1
| #define HAVE_STRING_H 1
| #define HAVE_MEMORY_H 1
| #define HAVE_STRINGS_H 1
| #define HAVE_INTTYPES_H 1
| #define HAVE_STDINT_H 1
| #define HAVE_UNISTD_H 1
| #define HAVE_CSTDLIB 1
| #define HAVE_CSTDIO 1
| #define HAVE_CSTRING 1
| #define HAVE_GL_GLX_H 1
| #define HAVE_SDL_SDL_H 1
| #define HAVE_X11_XLIB_H 1
| /* end confdefs.h. */
| #include <stdio.h>
| #if HAVE_SYS_TYPES_H
| # include <sys/types.h>
| #endif
| #if HAVE_SYS_STAT_H
| # include <sys/stat.h>
| #endif
| #if STDC_HEADERS
| # include <stdlib.h>
| # include <stddef.h>
| #else
| # if HAVE_STDLIB_H
| # include <stdlib.h>
| # endif
| #endif
| #if HAVE_STRING_H
| # if !STDC_HEADERS && HAVE_MEMORY_H
| # include <memory.h>
| # endif
| # include <string.h>
| #endif
| #if HAVE_STRINGS_H
| # include <strings.h>
| #endif
| #if HAVE_INTTYPES_H
| # include <inttypes.h>
| #else
| # if HAVE_STDINT_H
| # include <stdint.h>
| # endif
| #endif
| #if HAVE_UNISTD_H
| # include <unistd.h>
| #endif
| #include <bstring.h>
configure:5356: result: no
configure:5360: checking bstring.h presence
configure:5370: gcc -E conftest.c
conftest.c:34:21: bstring.h: No such file or directory
configure:5376: $? = 1
configure: failed program was:
| /* confdefs.h. */
|
| #define PACKAGE_NAME ""
| #define PACKAGE_TARNAME ""
| #define PACKAGE_VERSION ""
| #define PACKAGE_STRING ""
| #define PACKAGE_BUGREPORT ""
| #define PACKAGE "bzflag"
| #define VERSION "2.0.3.20050510"
| #define BZ_BUILD_OS "linux-gnu"
| #define BZ_BUILD_USER "wili"
| #define BUILD_REGEX 1
| #ifdef __cplusplus
| extern "C" void std::exit (int) throw (); using std::exit;
| #endif
| #define HAVE_CURL 1
| #define STDC_HEADERS 1
| #define HAVE_SYS_TYPES_H 1
| #define HAVE_SYS_STAT_H 1
| #define HAVE_STDLIB_H 1
| #define HAVE_STRING_H 1
| #define HAVE_MEMORY_H 1
| #define HAVE_STRINGS_H 1
| #define HAVE_INTTYPES_H 1
| #define HAVE_STDINT_H 1
| #define HAVE_UNISTD_H 1
| #define HAVE_CSTDLIB 1
| #define HAVE_CSTDIO 1
| #define HAVE_CSTRING 1
| #define HAVE_GL_GLX_H 1
| #define HAVE_SDL_SDL_H 1
| #define HAVE_X11_XLIB_H 1
| /* end confdefs.h. */
| #include <bstring.h>
configure:5396: result: no
configure:5431: checking for bstring.h
configure:5438: result: no
configure:5315: checking linux/input.h usability
configure:5327: gcc -c -g -O2 conftest.c >&5
configure:5333: $? = 0
configure:5337: test -z
|| test ! -s conftest.err
configure:5340: $? = 0
configure:5343: test -s conftest.o
configure:5346: $? = 0
configure:5356: result: yes
configure:5360: checking linux/input.h presence
configure:5370: gcc -E conftest.c
configure:5376: $? = 0
configure:5396: result: yes
configure:5431: checking for linux/input.h
configure:5438: result: yes
configure:5306: checking for stdint.h
configure:5311: result: yes
configure:5315: checking sys/param.h usability
configure:5327: gcc -c -g -O2 conftest.c >&5
configure:5333: $? = 0
configure:5337: test -z
|| test ! -s conftest.err
configure:5340: $? = 0
configure:5343: test -s conftest.o
configure:5346: $? = 0
configure:5356: result: yes
configure:5360: checking sys/param.h presence
configure:5370: gcc -E conftest.c
configure:5376: $? = 0
configure:5396: result: yes
configure:5431: checking for sys/param.h
configure:5438: result: yes
configure:5306: checking for unistd.h
configure:5311: result: yes
configure:5315: checking values.h usability
configure:5327: gcc -c -g -O2 conftest.c >&5
configure:5333: $? = 0
configure:5337: test -z
|| test ! -s conftest.err
configure:5340: $? = 0
configure:5343: test -s conftest.o
configure:5346: $? = 0
configure:5356: result: yes
configure:5360: checking values.h presence
configure:5370: gcc -E conftest.c
configure:5376: $? = 0
configure:5396: result: yes
configure:5431: checking for values.h
configure:5438: result: yes
configure:5455: checking for an ANSI C-conforming const
configure:5522: gcc -c -g -O2 conftest.c >&5
configure:5528: $? = 0
configure:5532: test -z
|| test ! -s conftest.err
configure:5535: $? = 0
configure:5538: test -s conftest.o
configure:5541: $? = 0
configure:5552: result: yes
configure:5563: checking for socklen_t type
configure:5582: gcc -c -g -O2 conftest.c >&5
configure:5588: $? = 0
configure:5592: test -z
|| test ! -s conftest.err
configure:5595: $? = 0
configure:5598: test -s conftest.o
configure:5601: $? = 0
configure:5624: result: yes
configure:5628: checking for linux rumble joystick support
configure:5646: gcc -c -g -O2 conftest.c >&5
configure:5652: $? = 0
configure:5656: test -z
|| test ! -s conftest.err
configure:5659: $? = 0
configure:5662: test -s conftest.o
configure:5665: $? = 0
configure:5682: result: yes
configure:5813: checking for X
configure:6043: result: libraries /usr/X11R6/lib, headers /usr/X11R6/include
configure:6215: gcc -o conftest -g -O2 conftest.c -L/usr/X11R6/lib -lX11 >&5
configure:6221: $? = 0
configure:6225: test -z
|| test ! -s conftest.err
configure:6228: $? = 0
configure:6231: test -s conftest
configure:6234: $? = 0
configure:6392: checking for gethostbyname
configure:6449: gcc -o conftest -g -O2 conftest.c >&5
configure:6455: $? = 0
configure:6459: test -z
|| test ! -s conftest.err
configure:6462: $? = 0
configure:6465: test -s conftest
configure:6468: $? = 0
configure:6480: result: yes
configure:6631: checking for connect
configure:6688: gcc -o conftest -g -O2 conftest.c >&5
configure:6694: $? = 0
configure:6698: test -z
|| test ! -s conftest.err
configure:6701: $? = 0
configure:6704: test -s conftest
configure:6707: $? = 0
configure:6719: result: yes
configure:6794: checking for remove
configure:6851: gcc -o conftest -g -O2 conftest.c >&5
configure:6857: $? = 0
configure:6861: test -z
|| test ! -s conftest.err
configure:6864: $? = 0
configure:6867: test -s conftest
configure:6870: $? = 0
configure:6882: result: yes
configure:6957: checking for shmat
configure:7014: gcc -o conftest -g -O2 conftest.c >&5
configure:7020: $? = 0
configure:7024: test -z
|| test ! -s conftest.err
configure:7027: $? = 0
configure:7030: test -s conftest
configure:7033: $? = 0
configure:7045: result: yes
configure:7129: checking for IceConnectionNumber in -lICE
configure:7159: gcc -o conftest -g -O2 -L/usr/X11R6/lib conftest.c -lICE >&5
configure:7165: $? = 0
configure:7169: test -z
|| test ! -s conftest.err
configure:7172: $? = 0
configure:7175: test -s conftest
configure:7178: $? = 0
configure:7191: result: yes
configure:7227: checking for sqrtf in -lm
configure:7257: gcc -o conftest -g -O2 -L/usr/X11R6/lib conftest.c -lm >&5
conftest.c:48: warning: conflicting types for built-in function 'sqrtf'
configure:7263: $? = 0
configure:7267: test -z
|| test ! -s conftest.err
configure:7270: $? = 0
configure:7273: test -s conftest
configure:7276: $? = 0
configure:7289: result: yes
configure:7303: checking for socket in -lsocket
configure:7333: gcc -o conftest -g -O2 -L/usr/X11R6/lib conftest.c -lsocket -lm >&5
/usr/bin/ld: cannot find -lsocket
collect2: ld returned 1 exit status
configure:7339: $? = 1
configure: failed program was:
| /* confdefs.h. */
|
| #define PACKAGE_NAME ""
| #define PACKAGE_TARNAME ""
| #define PACKAGE_VERSION ""
| #define PACKAGE_STRING ""
| #define PACKAGE_BUGREPORT ""
| #define PACKAGE "bzflag"
| #define VERSION "2.0.3.20050510"
| #define BZ_BUILD_OS "linux-gnu"
| #define BZ_BUILD_USER "wili"
| #define BUILD_REGEX 1
| #ifdef __cplusplus
| extern "C" void std::exit (int) throw (); using std::exit;
| #endif
| #define HAVE_CURL 1
| #define STDC_HEADERS 1
| #define HAVE_SYS_TYPES_H 1
| #define HAVE_SYS_STAT_H 1
| #define HAVE_STDLIB_H 1
| #define HAVE_STRING_H 1
| #define HAVE_MEMORY_H 1
| #define HAVE_STRINGS_H 1
| #define HAVE_INTTYPES_H 1
| #define HAVE_STDINT_H 1
| #define HAVE_UNISTD_H 1
| #define HAVE_CSTDLIB 1
| #define HAVE_CSTDIO 1
| #define HAVE_CSTRING 1
| #define HAVE_GL_GLX_H 1
| #define HAVE_SDL_SDL_H 1
| #define HAVE_X11_XLIB_H 1
| #define HAVE_LINUX_INPUT_H 1
| #define HAVE_STDINT_H 1
| #define HAVE_SYS_PARAM_H 1
| #define HAVE_UNISTD_H 1
| #define HAVE_VALUES_H 1
| #define HAVE_SOCKLEN_T 1
| #define HAVE_FF_EFFECT_RUMBLE 1
| #define HAVE_LIBM 1
| /* end confdefs.h. */
|
| /* Override any gcc2 internal prototype to avoid an error. */
| #ifdef __cplusplus
| extern "C"
| #endif
| /* We use char because int might match the return type of a gcc2
| builtin and then its argument prototype would still apply. */
| char socket ();
| int
| main ()
| {
| socket ();
| ;
| return 0;
| }
configure:7365: result: no
configure:7377: checking for gethostent in -lbind
configure:7407: gcc -o conftest -g -O2 -L/usr/X11R6/lib conftest.c -lbind -lm >&5
configure:7413: $? = 0
configure:7417: test -z
|| test ! -s conftest.err
configure:7420: $? = 0
configure:7423: test -s conftest
configure:7426: $? = 0
configure:7439: result: yes
configure:7452: checking for acosf in -lm
configure:7482: gcc -o conftest -g -O2 -L/usr/X11R6/lib conftest.c -lm -lbind -lm >&5
conftest.c:50: warning: conflicting types for built-in function 'acosf'
configure:7488: $? = 0
configure:7492: test -z
|| test ! -s conftest.err
configure:7495: $? = 0
configure:7498: test -s conftest
configure:7501: $? = 0
configure:7514: result: yes
configure:7524: checking for asinf in -lm
configure:7554: gcc -o conftest -g -O2 -L/usr/X11R6/lib conftest.c -lm -lbind -lm >&5
conftest.c:51: warning: conflicting types for built-in function 'asinf'
configure:7560: $? = 0
configure:7564: test -z
|| test ! -s conftest.err
configure:7567: $? = 0
configure:7570: test -s conftest
configure:7573: $? = 0
configure:7586: result: yes
configure:7596: checking for atan2f in -lm
configure:7626: gcc -o conftest -g -O2 -L/usr/X11R6/lib conftest.c -lm -lbind -lm >&5
conftest.c:52: warning: conflicting types for built-in function 'atan2f'
configure:7632: $? = 0
configure:7636: test -z
|| test ! -s conftest.err
configure:7639: $? = 0
configure:7642: test -s conftest
configure:7645: $? = 0
configure:7658: result: yes
configure:7668: checking for atanf in -lm
configure:7698: gcc -o conftest -g -O2 -L/usr/X11R6/lib conftest.c -lm -lbind -lm >&5
conftest.c:53: warning: conflicting types for built-in function 'atanf'
configure:7704: $? = 0
configure:7708: test -z
|| test ! -s conftest.err
configure:7711: $? = 0
configure:7714: test -s conftest
configure:7717: $? = 0
configure:7730: result: yes
configure:7740: checking for cosf in -lm
configure:7770: gcc -o conftest -g -O2 -L/usr/X11R6/lib conftest.c -lm -lbind -lm >&5
conftest.c:54: warning: conflicting types for built-in function 'cosf'
configure:7776: $? = 0
configure:7780: test -z
|| test ! -s conftest.err
configure:7783: $? = 0
configure:7786: test -s conftest
configure:7789: $? = 0
configure:7802: result: yes
configure:7812: checking for expf in -lm
configure:7842: gcc -o conftest -g -O2 -L/usr/X11R6/lib conftest.c -lm -lbind -lm >&5
conftest.c:55: warning: conflicting types for built-in function 'expf'
configure:7848: $? = 0
configure:7852: test -z
|| test ! -s conftest.err
configure:7855: $? = 0
configure:7858: test -s conftest
configure:7861: $? = 0
configure:7874: result: yes
configure:7884: checking for fabsf in -lm
configure:7914: gcc -o conftest -g -O2 -L/usr/X11R6/lib conftest.c -lm -lbind -lm >&5
conftest.c:56: warning: conflicting types for built-in function 'fabsf'
configure:7920: $? = 0
configure:7924: test -z
|| test ! -s conftest.err
configure:7927: $? = 0
configure:7930: test -s conftest
configure:7933: $? = 0
configure:7946: result: yes
configure:7956: checking for floorf in -lm
configure:7986: gcc -o conftest -g -O2 -L/usr/X11R6/lib conftest.c -lm -lbind -lm >&5
conftest.c:57: warning: conflicting types for built-in function 'floorf'
configure:7992: $? = 0
configure:7996: test -z
|| test ! -s conftest.err
configure:7999: $? = 0
configure:8002: test -s conftest
configure:8005: $? = 0
configure:8018: result: yes
configure:8028: checking for fmodf in -lm
configure:8058: gcc -o conftest -g -O2 -L/usr/X11R6/lib conftest.c -lm -lbind -lm >&5
conftest.c:58: warning: conflicting types for built-in function 'fmodf'
configure:8064: $? = 0
configure:8068: test -z
|| test ! -s conftest.err
configure:8071: $? = 0
configure:8074: test -s conftest
configure:8077: $? = 0
configure:8090: result: yes
configure:8100: checking for hypotf in -lm
configure:8130: gcc -o conftest -g -O2 -L/usr/X11R6/lib conftest.c -lm -lbind -lm >&5
conftest.c:59: warning: conflicting types for built-in function 'hypotf'
configure:8136: $? = 0
configure:8140: test -z
|| test ! -s conftest.err
configure:8143: $? = 0
configure:8146: test -s conftest
configure:8149: $? = 0
configure:8162: result: yes
configure:8172: checking for logf in -lm
configure:8202: gcc -o conftest -g -O2 -L/usr/X11R6/lib conftest.c -lm -lbind -lm >&5
conftest.c:60: warning: conflicting types for built-in function 'logf'
configure:8208: $? = 0
configure:8212: test -z
|| test ! -s conftest.err
configure:8215: $? = 0
configure:8218: test -s conftest
configure:8221: $? = 0
configure:8234: result: yes
configure:8244: checking for powf in -lm
configure:8274: gcc -o conftest -g -O2 -L/usr/X11R6/lib conftest.c -lm -lbind -lm >&5
conftest.c:61: warning: conflicting types for built-in function 'powf'
configure:8280: $? = 0
configure:8284: test -z
|| test ! -s conftest.err
configure:8287: $? = 0
configure:8290: test -s conftest
configure:8293: $? = 0
configure:8306: result: yes
configure:8316: checking for sinf in -lm
configure:8346: gcc -o conftest -g -O2 -L/usr/X11R6/lib conftest.c -lm -lbind -lm >&5
conftest.c:62: warning: conflicting types for built-in function 'sinf'
configure:8352: $? = 0
configure:8356: test -z
|| test ! -s conftest.err
configure:8359: $? = 0
configure:8362: test -s conftest
configure:8365: $? = 0
configure:8378: result: yes
configure:8388: checking for sqrtf in -lm
configure:8450: result: yes
configure:8460: checking for tanf in -lm
configure:8490: gcc -o conftest -g -O2 -L/usr/X11R6/lib conftest.c -lm -lbind -lm >&5
conftest.c:64: warning: conflicting types for built-in function 'tanf'
configure:8496: $? = 0
configure:8500: test -z
|| test ! -s conftest.err
configure:8503: $? = 0
configure:8506: test -s conftest
configure:8509: $? = 0
configure:8522: result: yes
configure:8545: checking for XextAddDisplay in -lXext
configure:8575: gcc -o conftest -g -O2 -L/usr/X11R6/lib conftest.c -lXext -lSM -lICE -lX11 -lbind -lm >&5
configure:8581: $? = 0
configure:8585: test -z
|| test ! -s conftest.err
configure:8588: $? = 0
configure:8591: test -s conftest
configure:8594: $? = 0
configure:8607: result: yes
configure:8615: checking for XF86VidModeGetAllModeLines in -lXxf86vm
configure:8645: gcc -o conftest -g -O2 -L/usr/X11R6/lib conftest.c -lXxf86vm -lXext -lSM -lICE -lX11 -lbind -lm >&5
configure:8651: $? = 0
configure:8655: test -z
|| test ! -s conftest.err
configure:8658: $? = 0
configure:8661: test -s conftest
configure:8664: $? = 0
configure:8677: result: yes
configure:8683: checking for XListInputDevices in -lXi
configure:8713: gcc -o conftest -g -O2 -L/usr/X11R6/lib conftest.c -lXi -lXxf86vm -lXext -lSM -lICE -lX11 -lbind -lm >&5
configure:8719: $? = 0
configure:8723: test -z
|| test ! -s conftest.err
configure:8726: $? = 0
configure:8729: test -s conftest
configure:8732: $? = 0
configure:8745: result: yes
configure:8784: g++ -o conftest -g -O2 -L/usr/X11R6/lib conftest.cc -lbind -lm >&5
configure:8790: $? = 0
configure:8794: test -z
|| test ! -s conftest.err
configure:8797: $? = 0
configure:8800: test -s conftest
configure:8803: $? = 0
configure:8839: g++ -c -g -O2 conftest.cc >&5
configure:8845: $? = 0
configure:8849: test -z
|| test ! -s conftest.err
configure:8852: $? = 0
configure:8855: test -s conftest.o
configure:8858: $? = 0
configure:8893: g++ -o conftest -g -O2 -L/usr/X11R6/lib conftest.cc -framework OpenGL -lXi -lXxf86vm -lXext -lSM -lICE -lX11 -lbind -lm >&5
g++: OpenGL: No such file or directory
cc1plus: error: unrecognized command line option "-framework"
configure:8899: $? = 1
configure: failed program was:
| /* confdefs.h. */
|
| #define PACKAGE_NAME ""
| #define PACKAGE_TARNAME ""
| #define PACKAGE_VERSION ""
| #define PACKAGE_STRING ""
| #define PACKAGE_BUGREPORT ""
| #define PACKAGE "bzflag"
| #define VERSION "2.0.3.20050510"
| #define BZ_BUILD_OS "linux-gnu"
| #define BZ_BUILD_USER "wili"
| #define BUILD_REGEX 1
| #ifdef __cplusplus
| extern "C" void std::exit (int) throw (); using std::exit;
| #endif
| #define HAVE_CURL 1
| #define STDC_HEADERS 1
| #define HAVE_SYS_TYPES_H 1
| #define HAVE_SYS_STAT_H 1
| #define HAVE_STDLIB_H 1
| #define HAVE_STRING_H 1
| #define HAVE_MEMORY_H 1
| #define HAVE_STRINGS_H 1
| #define HAVE_INTTYPES_H 1
| #define HAVE_STDINT_H 1
| #define HAVE_UNISTD_H 1
| #define HAVE_CSTDLIB 1
| #define HAVE_CSTDIO 1
| #define HAVE_CSTRING 1
| #define HAVE_GL_GLX_H 1
| #define HAVE_SDL_SDL_H 1
| #define HAVE_X11_XLIB_H 1
| #define HAVE_LINUX_INPUT_H 1
| #define HAVE_STDINT_H 1
| #define HAVE_SYS_PARAM_H 1
| #define HAVE_UNISTD_H 1
| #define HAVE_VALUES_H 1
| #define HAVE_SOCKLEN_T 1
| #define HAVE_FF_EFFECT_RUMBLE 1
| #define HAVE_LIBM 1
| #define HAVE_LIBBIND 1
| #define HAVE_ACOSF 1
| #define HAVE_ASINF 1
| #define HAVE_ATAN2F 1
| #define HAVE_ATANF 1
| #define HAVE_COSF 1
| #define HAVE_EXPF 1
| #define HAVE_FABSF 1
| #define HAVE_FLOORF 1
| #define HAVE_FMODF 1
| #define HAVE_HYPOTF 1
| #define HAVE_LOGF 1
| #define HAVE_POWF 1
| #define HAVE_SINF 1
| #define HAVE_SQRTF 1
| #define HAVE_TANF 1
| #define HAVE_REGEX_H 1
| #define HAVE_STD_COUNT 1
| /* end confdefs.h. */
| #include <OpenGL/gl.h>
| int
| main ()
| {
| glBegin(GL_POINTS)
| ;
| return 0;
| }
configure:8940: g++ -o conftest -g -O2 -L/usr/X11R6/lib conftest.cc -lopengl32 -lXi -lXxf86vm -lXext -lSM -lICE -lX11 -lbind -lm >&5
/usr/bin/ld: cannot find -lopengl32
collect2: ld returned 1 exit status
configure:8946: $? = 1
configure: failed program was:
| /* confdefs.h. */
|
| #define PACKAGE_NAME ""
| #define PACKAGE_TARNAME ""
| #define PACKAGE_VERSION ""
| #define PACKAGE_STRING ""
| #define PACKAGE_BUGREPORT ""
| #define PACKAGE "bzflag"
| #define VERSION "2.0.3.20050510"
| #define BZ_BUILD_OS "linux-gnu"
| #define BZ_BUILD_USER "wili"
| #define BUILD_REGEX 1
| #ifdef __cplusplus
| extern "C" void std::exit (int) throw (); using std::exit;
| #endif
| #define HAVE_CURL 1
| #define STDC_HEADERS 1
| #define HAVE_SYS_TYPES_H 1
| #define HAVE_SYS_STAT_H 1
| #define HAVE_STDLIB_H 1
| #define HAVE_STRING_H 1
| #define HAVE_MEMORY_H 1
| #define HAVE_STRINGS_H 1
| #define HAVE_INTTYPES_H 1
| #define HAVE_STDINT_H 1
| #define HAVE_UNISTD_H 1
| #define HAVE_CSTDLIB 1
| #define HAVE_CSTDIO 1
| #define HAVE_CSTRING 1
| #define HAVE_GL_GLX_H 1
| #define HAVE_SDL_SDL_H 1
| #define HAVE_X11_XLIB_H 1
| #define HAVE_LINUX_INPUT_H 1
| #define HAVE_STDINT_H 1
| #define HAVE_SYS_PARAM_H 1
| #define HAVE_UNISTD_H 1
| #define HAVE_VALUES_H 1
| #define HAVE_SOCKLEN_T 1
| #define HAVE_FF_EFFECT_RUMBLE 1
| #define HAVE_LIBM 1
| #define HAVE_LIBBIND 1
| #define HAVE_ACOSF 1
| #define HAVE_ASINF 1
| #define HAVE_ATAN2F 1
| #define HAVE_ATANF 1
| #define HAVE_COSF 1
| #define HAVE_EXPF 1
| #define HAVE_FABSF 1
| #define HAVE_FLOORF 1
| #define HAVE_FMODF 1
| #define HAVE_HYPOTF 1
| #define HAVE_LOGF 1
| #define HAVE_POWF 1
| #define HAVE_SINF 1
| #define HAVE_SQRTF 1
| #define HAVE_TANF 1
| #define HAVE_REGEX_H 1
| #define HAVE_STD_COUNT 1
| /* end confdefs.h. */
| #include <GL/gl.h>
| int
| main ()
| {
| glBegin(GL_POINTS)
| ;
| return 0;
| }
configure:8940: g++ -o conftest -g -O2 -L/usr/X11R6/lib conftest.cc -lGL -lXi -lXxf86vm -lXext -lSM -lICE -lX11 -lbind -lm >&5
configure:8946: $? = 0
configure:8950: test -z
|| test ! -s conftest.err
configure:8953: $? = 0
configure:8956: test -s conftest
configure:8959: $? = 0
configure:8998: g++ -o conftest -g -O2 -L/usr/X11R6/lib conftest.cc -framework OpenGL -lbind -lm >&5
g++: OpenGL: No such file or directory
cc1plus: error: unrecognized command line option "-framework"
configure:9004: $? = 1
configure: failed program was:
| /* confdefs.h. */
|
| #define PACKAGE_NAME ""
| #define PACKAGE_TARNAME ""
| #define PACKAGE_VERSION ""
| #define PACKAGE_STRING ""
| #define PACKAGE_BUGREPORT ""
| #define PACKAGE "bzflag"
| #define VERSION "2.0.3.20050510"
| #define BZ_BUILD_OS "linux-gnu"
| #define BZ_BUILD_USER "wili"
| #define BUILD_REGEX 1
| #ifdef __cplusplus
| extern "C" void std::exit (int) throw (); using std::exit;
| #endif
| #define HAVE_CURL 1
| #define STDC_HEADERS 1
| #define HAVE_SYS_TYPES_H 1
| #define HAVE_SYS_STAT_H 1
| #define HAVE_STDLIB_H 1
| #define HAVE_STRING_H 1
| #define HAVE_MEMORY_H 1
| #define HAVE_STRINGS_H 1
| #define HAVE_INTTYPES_H 1
| #define HAVE_STDINT_H 1
| #define HAVE_UNISTD_H 1
| #define HAVE_CSTDLIB 1
| #define HAVE_CSTDIO 1
| #define HAVE_CSTRING 1
| #define HAVE_GL_GLX_H 1
| #define HAVE_SDL_SDL_H 1
| #define HAVE_X11_XLIB_H 1
| #define HAVE_LINUX_INPUT_H 1
| #define HAVE_STDINT_H 1
| #define HAVE_SYS_PARAM_H 1
| #define HAVE_UNISTD_H 1
| #define HAVE_VALUES_H 1
| #define HAVE_SOCKLEN_T 1
| #define HAVE_FF_EFFECT_RUMBLE 1
| #define HAVE_LIBM 1
| #define HAVE_LIBBIND 1
| #define HAVE_ACOSF 1
| #define HAVE_ASINF 1
| #define HAVE_ATAN2F 1
| #define HAVE_ATANF 1
| #define HAVE_COSF 1
| #define HAVE_EXPF 1
| #define HAVE_FABSF 1
| #define HAVE_FLOORF 1
| #define HAVE_FMODF 1
| #define HAVE_HYPOTF 1
| #define HAVE_LOGF 1
| #define HAVE_POWF 1
| #define HAVE_SINF 1
| #define HAVE_SQRTF 1
| #define HAVE_TANF 1
| #define HAVE_REGEX_H 1
| #define HAVE_STD_COUNT 1
| /* end confdefs.h. */
| #include <OpenGL/glu.h>
| int
| main ()
| {
| gluScaleImage(GL_RED,0,0,GL_INT,0,0,0,GL_INT,0)
| ;
| return 0;
| }
configure:9045: g++ -o conftest -g -O2 -L/usr/X11R6/lib conftest.cc -lglu32 -lGL -lXi -lXxf86vm -lXext -lSM -lICE -lX11 -lbind -lm >&5
/usr/bin/ld: cannot find -lglu32
collect2: ld returned 1 exit status
configure:9051: $? = 1
configure: failed program was:
| /* confdefs.h. */
|
| #define PACKAGE_NAME ""
| #define PACKAGE_TARNAME ""
| #define PACKAGE_VERSION ""
| #define PACKAGE_STRING ""
| #define PACKAGE_BUGREPORT ""
| #define PACKAGE "bzflag"
| #define VERSION "2.0.3.20050510"
| #define BZ_BUILD_OS "linux-gnu"
| #define BZ_BUILD_USER "wili"
| #define BUILD_REGEX 1
| #ifdef __cplusplus
| extern "C" void std::exit (int) throw (); using std::exit;
| #endif
| #define HAVE_CURL 1
| #define STDC_HEADERS 1
| #define HAVE_SYS_TYPES_H 1
| #define HAVE_SYS_STAT_H 1
| #define HAVE_STDLIB_H 1
| #define HAVE_STRING_H 1
| #define HAVE_MEMORY_H 1
| #define HAVE_STRINGS_H 1
| #define HAVE_INTTYPES_H 1
| #define HAVE_STDINT_H 1
| #define HAVE_UNISTD_H 1
| #define HAVE_CSTDLIB 1
| #define HAVE_CSTDIO 1
| #define HAVE_CSTRING 1
| #define HAVE_GL_GLX_H 1
| #define HAVE_SDL_SDL_H 1
| #define HAVE_X11_XLIB_H 1
| #define HAVE_LINUX_INPUT_H 1
| #define HAVE_STDINT_H 1
| #define HAVE_SYS_PARAM_H 1
| #define HAVE_UNISTD_H 1
| #define HAVE_VALUES_H 1
| #define HAVE_SOCKLEN_T 1
| #define HAVE_FF_EFFECT_RUMBLE 1
| #define HAVE_LIBM 1
| #define HAVE_LIBBIND 1
| #define HAVE_ACOSF 1
| #define HAVE_ASINF 1
| #define HAVE_ATAN2F 1
| #define HAVE_ATANF 1
| #define HAVE_COSF 1
| #define HAVE_EXPF 1
| #define HAVE_FABSF 1
| #define HAVE_FLOORF 1
| #define HAVE_FMODF 1
| #define HAVE_HYPOTF 1
| #define HAVE_LOGF 1
| #define HAVE_POWF 1
| #define HAVE_SINF 1
| #define HAVE_SQRTF 1
| #define HAVE_TANF 1
| #define HAVE_REGEX_H 1
| #define HAVE_STD_COUNT 1
| /* end confdefs.h. */
| #include <GL/glu.h>
| int
| main ()
| {
| gluScaleImage(GL_RED,0,0,GL_INT,0,0,0,GL_INT,0)
| ;
| return 0;
| }
configure:9045: g++ -o conftest -g -O2 -L/usr/X11R6/lib conftest.cc -lGL -lGL -lXi -lXxf86vm -lXext -lSM -lICE -lX11 -lbind -lm >&5
/tmp/ccIf5COQ.o(.text+0x28): In function `main':
/home/linux/bzflag/conftest.cc:64: undefined reference to `gluScaleImage'
collect2: ld returned 1 exit status
configure:9051: $? = 1
configure: failed program was:
| /* confdefs.h. */
|
| #define PACKAGE_NAME ""
| #define PACKAGE_TARNAME ""
| #define PACKAGE_VERSION ""
| #define PACKAGE_STRING ""
| #define PACKAGE_BUGREPORT ""
| #define PACKAGE "bzflag"
| #define VERSION "2.0.3.20050510"
| #define BZ_BUILD_OS "linux-gnu"
| #define BZ_BUILD_USER "wili"
| #define BUILD_REGEX 1
| #ifdef __cplusplus
| extern "C" void std::exit (int) throw (); using std::exit;
| #endif
| #define HAVE_CURL 1
| #define STDC_HEADERS 1
| #define HAVE_SYS_TYPES_H 1
| #define HAVE_SYS_STAT_H 1
| #define HAVE_STDLIB_H 1
| #define HAVE_STRING_H 1
| #define HAVE_MEMORY_H 1
| #define HAVE_STRINGS_H 1
| #define HAVE_INTTYPES_H 1
| #define HAVE_STDINT_H 1
| #define HAVE_UNISTD_H 1
| #define HAVE_CSTDLIB 1
| #define HAVE_CSTDIO 1
| #define HAVE_CSTRING 1
| #define HAVE_GL_GLX_H 1
| #define HAVE_SDL_SDL_H 1
| #define HAVE_X11_XLIB_H 1
| #define HAVE_LINUX_INPUT_H 1
| #define HAVE_STDINT_H 1
| #define HAVE_SYS_PARAM_H 1
| #define HAVE_UNISTD_H 1
| #define HAVE_VALUES_H 1
| #define HAVE_SOCKLEN_T 1
| #define HAVE_FF_EFFECT_RUMBLE 1
| #define HAVE_LIBM 1
| #define HAVE_LIBBIND 1
| #define HAVE_ACOSF 1
| #define HAVE_ASINF 1
| #define HAVE_ATAN2F 1
| #define HAVE_ATANF 1
| #define HAVE_COSF 1
| #define HAVE_EXPF 1
| #define HAVE_FABSF 1
| #define HAVE_FLOORF 1
| #define HAVE_FMODF 1
| #define HAVE_HYPOTF 1
| #define HAVE_LOGF 1
| #define HAVE_POWF 1
| #define HAVE_SINF 1
| #define HAVE_SQRTF 1
| #define HAVE_TANF 1
| #define HAVE_REGEX_H 1
| #define HAVE_STD_COUNT 1
| /* end confdefs.h. */
| #include <GL/glu.h>
| int
| main ()
| {
| gluScaleImage(GL_RED,0,0,GL_INT,0,0,0,GL_INT,0)
| ;
| return 0;
| }
configure:9045: g++ -o conftest -g -O2 -L/usr/X11R6/lib conftest.cc -lGLU -lGL -lXi -lXxf86vm -lXext -lSM -lICE -lX11 -lbind -lm >&5
configure:9051: $? = 0
configure:9055: test -z
|| test ! -s conftest.err
configure:9058: $? = 0
configure:9061: test -s conftest
configure:9064: $? = 0
configure:9220: checking for working ncurses
configure:9242: g++ -o conftest -g -O2 -L/usr/X11R6/lib conftest.cc -lbind -lm -lncurses >&5
configure:9248: $? = 0
configure:9252: test -z
|| test ! -s conftest.err
configure:9255: $? = 0
configure:9258: test -s conftest
configure:9261: $? = 0
configure:9273: result: yes
configure:9551: checking for SDL framework
configure:9572: gcc -o conftest -g -O2 -L/usr/X11R6/lib -framework SDL conftest.c -lGLU -lGL -lXi -lXxf86vm -lXext -lSM -lICE -lX11 -lbind -lm >&5
gcc: SDL: No such file or directory
cc1: error: unrecognized command line option "-framework"
configure:9578: $? = 1
configure: failed program was:
| /* confdefs.h. */
|
| #define PACKAGE_NAME ""
| #define PACKAGE_TARNAME ""
| #define PACKAGE_VERSION ""
| #define PACKAGE_STRING ""
| #define PACKAGE_BUGREPORT ""
| #define PACKAGE "bzflag"
| #define VERSION "2.0.3.20050510"
| #define BZ_BUILD_OS "linux-gnu"
| #define BZ_BUILD_USER "wili"
| #define BUILD_REGEX 1
| #ifdef __cplusplus
| extern "C" void std::exit (int) throw (); using std::exit;
| #endif
| #define HAVE_CURL 1
| #define STDC_HEADERS 1
| #define HAVE_SYS_TYPES_H 1
| #define HAVE_SYS_STAT_H 1
| #define HAVE_STDLIB_H 1
| #define HAVE_STRING_H 1
| #define HAVE_MEMORY_H 1
| #define HAVE_STRINGS_H 1
| #define HAVE_INTTYPES_H 1
| #define HAVE_STDINT_H 1
| #define HAVE_UNISTD_H 1
| #define HAVE_CSTDLIB 1
| #define HAVE_CSTDIO 1
| #define HAVE_CSTRING 1
| #define HAVE_GL_GLX_H 1
| #define HAVE_SDL_SDL_H 1
| #define HAVE_X11_XLIB_H 1
| #define HAVE_LINUX_INPUT_H 1
| #define HAVE_STDINT_H 1
| #define HAVE_SYS_PARAM_H 1
| #define HAVE_UNISTD_H 1
| #define HAVE_VALUES_H 1
| #define HAVE_SOCKLEN_T 1
| #define HAVE_FF_EFFECT_RUMBLE 1
| #define HAVE_LIBM 1
| #define HAVE_LIBBIND 1
| #define HAVE_ACOSF 1
| #define HAVE_ASINF 1
| #define HAVE_ATAN2F 1
| #define HAVE_ATANF 1
| #define HAVE_COSF 1
| #define HAVE_EXPF 1
| #define HAVE_FABSF 1
| #define HAVE_FLOORF 1
| #define HAVE_FMODF 1
| #define HAVE_HYPOTF 1
| #define HAVE_LOGF 1
| #define HAVE_POWF 1
| #define HAVE_SINF 1
| #define HAVE_SQRTF 1
| #define HAVE_TANF 1
| #define HAVE_REGEX_H 1
| #define HAVE_STD_COUNT 1
| #define HAVE_NCURSES_H
| /* end confdefs.h. */
| #include <SDL/SDL_version.h>
| int
| main ()
| {
|
| ;
| return 0;
| }
configure:9602: result: no
configure:9651: checking for sdl-config
configure:9669: found /usr/local/bin/sdl-config
configure:9682: result: /usr/local/bin/sdl-config
configure:9690: checking for SDL - version >= 1.2.5
configure:9782: gcc -o conftest -g -O2 -I/usr/local/include/SDL -D_REENTRANT -L/usr/X11R6/lib conftest.c -lGLU -lGL -lXi -lXxf86vm -lXext -lSM -lICE -lX11 -lbind -lm -L/usr/local/lib -Wl,-rpath,/usr/local/lib -lSDL -lpthread >&5
configure:9785: $? = 0
configure:9787: ./conftest
configure:9790: $? = 0
configure:9809: result: yes
configure:10191: checking if the compiler understands -Wl,-search_paths_first -mdynamic-no-pic
configure:10212: g++ -o conftest -g -O2 -DBZ_BUILD_DATE=20050510 -ffast-math -fno-exceptions -fsigned-char -Wall -W -Wshadow -mcpu=i686 -L/usr/X11R6/lib -Wl,-search_paths_first -mdynamic-no-pic conftest.cc -lbind -lm >&5
cc1plus: error: invalid option `dynamic-no-pic'
configure:10218: $? = 1
configure: failed program was:
| /* confdefs.h. */
|
| #define PACKAGE_NAME ""
| #define PACKAGE_TARNAME ""
| #define PACKAGE_VERSION ""
| #define PACKAGE_STRING ""
| #define PACKAGE_BUGREPORT ""
| #define PACKAGE "bzflag"
| #define VERSION "2.0.3.20050510"
| #define BZ_BUILD_OS "linux-gnu"
| #define BZ_BUILD_USER "wili"
| #define BUILD_REGEX 1
| #ifdef __cplusplus
| extern "C" void std::exit (int) throw (); using std::exit;
| #endif
| #define HAVE_CURL 1
| #define STDC_HEADERS 1
| #define HAVE_SYS_TYPES_H 1
| #define HAVE_SYS_STAT_H 1
| #define HAVE_STDLIB_H 1
| #define HAVE_STRING_H 1
| #define HAVE_MEMORY_H 1
| #define HAVE_STRINGS_H 1
| #define HAVE_INTTYPES_H 1
| #define HAVE_STDINT_H 1
| #define HAVE_UNISTD_H 1
| #define HAVE_CSTDLIB 1
| #define HAVE_CSTDIO 1
| #define HAVE_CSTRING 1
| #define HAVE_GL_GLX_H 1
| #define HAVE_SDL_SDL_H 1
| #define HAVE_X11_XLIB_H 1
| #define HAVE_LINUX_INPUT_H 1
| #define HAVE_STDINT_H 1
| #define HAVE_SYS_PARAM_H 1
| #define HAVE_UNISTD_H 1
| #define HAVE_VALUES_H 1
| #define HAVE_SOCKLEN_T 1
| #define HAVE_FF_EFFECT_RUMBLE 1
| #define HAVE_LIBM 1
| #define HAVE_LIBBIND 1
| #define HAVE_ACOSF 1
| #define HAVE_ASINF 1
| #define HAVE_ATAN2F 1
| #define HAVE_ATANF 1
| #define HAVE_COSF 1
| #define HAVE_EXPF 1
| #define HAVE_FABSF 1
| #define HAVE_FLOORF 1
| #define HAVE_FMODF 1
| #define HAVE_HYPOTF 1
| #define HAVE_LOGF 1
| #define HAVE_POWF 1
| #define HAVE_SINF 1
| #define HAVE_SQRTF 1
| #define HAVE_TANF 1
| #define HAVE_REGEX_H 1
| #define HAVE_STD_COUNT 1
| #define HAVE_NCURSES_H
| #define HAVE_SDL 1
| #define ROBOT 1
| #define SNAPPING 1
| #define INSTALL_DATA_DIR "/usr/local/share/bzflag"
| #define HALF_RATE_AUDIO 1
| #define XF86VIDMODE_EXT 1
| #define NDEBUG 1
| /* end confdefs.h. */
|
| int
| main ()
| {
|
| ;
| return 0;
| }
configure:10242: result: no
configure:10282: checking for CGLGetCurrentContext
configure:10339: g++ -o conftest -g -O2 -DBZ_BUILD_DATE=20050510 -ffast-math -fno-exceptions -fsigned-char -Wall -W -Wshadow -mcpu=i686 -L/usr/X11R6/lib conftest.cc -lbind -lm >&5
/tmp/cckYjUHl.o(.text+0x14): In function `main':
/home/linux/bzflag/conftest.cc:108: undefined reference to `CGLGetCurrentContext'
/tmp/cckYjUHl.o(.data+0x0): undefined reference to `CGLGetCurrentContext'
collect2: ld returned 1 exit status
configure:10345: $? = 1
configure: failed program was:
| /* confdefs.h. */
|
| #define PACKAGE_NAME ""
| #define PACKAGE_TARNAME ""
| #define PACKAGE_VERSION ""
| #define PACKAGE_STRING ""
| #define PACKAGE_BUGREPORT ""
| #define PACKAGE "bzflag"
| #define VERSION "2.0.3.20050510"
| #define BZ_BUILD_OS "linux-gnu"
| #define BZ_BUILD_USER "wili"
| #define BUILD_REGEX 1
| #ifdef __cplusplus
| extern "C" void std::exit (int) throw (); using std::exit;
| #endif
| #define HAVE_CURL 1
| #define STDC_HEADERS 1
| #define HAVE_SYS_TYPES_H 1
| #define HAVE_SYS_STAT_H 1
| #define HAVE_STDLIB_H 1
| #define HAVE_STRING_H 1
| #define HAVE_MEMORY_H 1
| #define HAVE_STRINGS_H 1
| #define HAVE_INTTYPES_H 1
| #define HAVE_STDINT_H 1
| #define HAVE_UNISTD_H 1
| #define HAVE_CSTDLIB 1
| #define HAVE_CSTDIO 1
| #define HAVE_CSTRING 1
| #define HAVE_GL_GLX_H 1
| #define HAVE_SDL_SDL_H 1
| #define HAVE_X11_XLIB_H 1
| #define HAVE_LINUX_INPUT_H 1
| #define HAVE_STDINT_H 1
| #define HAVE_SYS_PARAM_H 1
| #define HAVE_UNISTD_H 1
| #define HAVE_VALUES_H 1
| #define HAVE_SOCKLEN_T 1
| #define HAVE_FF_EFFECT_RUMBLE 1
| #define HAVE_LIBM 1
| #define HAVE_LIBBIND 1
| #define HAVE_ACOSF 1
| #define HAVE_ASINF 1
| #define HAVE_ATAN2F 1
| #define HAVE_ATANF 1
| #define HAVE_COSF 1
| #define HAVE_EXPF 1
| #define HAVE_FABSF 1
| #define HAVE_FLOORF 1
| #define HAVE_FMODF 1
| #define HAVE_HYPOTF 1
| #define HAVE_LOGF 1
| #define HAVE_POWF 1
| #define HAVE_SINF 1
| #define HAVE_SQRTF 1
| #define HAVE_TANF 1
| #define HAVE_REGEX_H 1
| #define HAVE_STD_COUNT 1
| #define HAVE_NCURSES_H
| #define HAVE_SDL 1
| #define ROBOT 1
| #define SNAPPING 1
| #define INSTALL_DATA_DIR "/usr/local/share/bzflag"
| #define HALF_RATE_AUDIO 1
| #define XF86VIDMODE_EXT 1
| #define NDEBUG 1
| /* end confdefs.h. */
| /* Define CGLGetCurrentContext to an innocuous variant, in case <limits.h> declares CGLGetCurrentContext.
| For example, HP-UX 11i <limits.h> declares gettimeofday. */
| #define CGLGetCurrentContext innocuous_CGLGetCurrentContext
|
| /* System header to define __stub macros and hopefully few prototypes,
| which can conflict with char CGLGetCurrentContext (); below.
| Prefer <limits.h> to <assert.h> if __STDC__ is defined, since
| <limits.h> exists even on freestanding compilers. */
|
| #ifdef __STDC__
| # include <limits.h>
| #else
| # include <assert.h>
| #endif
|
| #undef CGLGetCurrentContext
|
| /* Override any gcc2 internal prototype to avoid an error. */
| #ifdef __cplusplus
| extern "C"
| {
| #endif
| /* We use char because int might match the return type of a gcc2
| builtin and then its argument prototype would still apply. */
| char CGLGetCurrentContext ();
| /* The GNU C library defines this for functions which it implements
| to always fail with ENOSYS. Some functions are actually named
| something starting with __ and the normal name is an alias. */
| #if defined (__stub_CGLGetCurrentContext) || defined (__stub___CGLGetCurrentContext)
| choke me
| #else
| char (*f) () = CGLGetCurrentContext;
| #endif
| #ifdef __cplusplus
| }
| #endif
|
| int
| main ()
| {
| return f != CGLGetCurrentContext;
| ;
| return 0;
| }
configure:10370: result: no
configure:10282: checking for Sleep
configure:10339: g++ -o conftest -g -O2 -DBZ_BUILD_DATE=20050510 -ffast-math -fno-exceptions -fsigned-char -Wall -W -Wshadow -mcpu=i686 -L/usr/X11R6/lib conftest.cc -lbind -lm >&5
/tmp/ccylizQB.o(.text+0x14): In function `main':
/home/linux/bzflag/conftest.cc:108: undefined reference to `Sleep'
/tmp/ccylizQB.o(.data+0x0): undefined reference to `Sleep'
collect2: ld returned 1 exit status
configure:10345: $? = 1
configure: failed program was:
| /* confdefs.h. */
|
| #define PACKAGE_NAME ""
| #define PACKAGE_TARNAME ""
| #define PACKAGE_VERSION ""
| #define PACKAGE_STRING ""
| #define PACKAGE_BUGREPORT ""
| #define PACKAGE "bzflag"
| #define VERSION "2.0.3.20050510"
| #define BZ_BUILD_OS "linux-gnu"
| #define BZ_BUILD_USER "wili"
| #define BUILD_REGEX 1
| #ifdef __cplusplus
| extern "C" void std::exit (int) throw (); using std::exit;
| #endif
| #define HAVE_CURL 1
| #define STDC_HEADERS 1
| #define HAVE_SYS_TYPES_H 1
| #define HAVE_SYS_STAT_H 1
| #define HAVE_STDLIB_H 1
| #define HAVE_STRING_H 1
| #define HAVE_MEMORY_H 1
| #define HAVE_STRINGS_H 1
| #define HAVE_INTTYPES_H 1
| #define HAVE_STDINT_H 1
| #define HAVE_UNISTD_H 1
| #define HAVE_CSTDLIB 1
| #define HAVE_CSTDIO 1
| #define HAVE_CSTRING 1
| #define HAVE_GL_GLX_H 1
| #define HAVE_SDL_SDL_H 1
| #define HAVE_X11_XLIB_H 1
| #define HAVE_LINUX_INPUT_H 1
| #define HAVE_STDINT_H 1
| #define HAVE_SYS_PARAM_H 1
| #define HAVE_UNISTD_H 1
| #define HAVE_VALUES_H 1
| #define HAVE_SOCKLEN_T 1
| #define HAVE_FF_EFFECT_RUMBLE 1
| #define HAVE_LIBM 1
| #define HAVE_LIBBIND 1
| #define HAVE_ACOSF 1
| #define HAVE_ASINF 1
| #define HAVE_ATAN2F 1
| #define HAVE_ATANF 1
| #define HAVE_COSF 1
| #define HAVE_EXPF 1
| #define HAVE_FABSF 1
| #define HAVE_FLOORF 1
| #define HAVE_FMODF 1
| #define HAVE_HYPOTF 1
| #define HAVE_LOGF 1
| #define HAVE_POWF 1
| #define HAVE_SINF 1
| #define HAVE_SQRTF 1
| #define HAVE_TANF 1
| #define HAVE_REGEX_H 1
| #define HAVE_STD_COUNT 1
| #define HAVE_NCURSES_H
| #define HAVE_SDL 1
| #define ROBOT 1
| #define SNAPPING 1
| #define INSTALL_DATA_DIR "/usr/local/share/bzflag"
| #define HALF_RATE_AUDIO 1
| #define XF86VIDMODE_EXT 1
| #define NDEBUG 1
| /* end confdefs.h. */
| /* Define Sleep to an innocuous variant, in case <limits.h> declares Sleep.
| For example, HP-UX 11i <limits.h> declares gettimeofday. */
| #define Sleep innocuous_Sleep
|
| /* System header to define __stub macros and hopefully few prototypes,
| which can conflict with char Sleep (); below.
| Prefer <limits.h> to <assert.h> if __STDC__ is defined, since
| <limits.h> exists even on freestanding compilers. */
|
| #ifdef __STDC__
| # include <limits.h>
| #else
| # include <assert.h>
| #endif
|
| #undef Sleep
|
| /* Override any gcc2 internal prototype to avoid an error. */
| #ifdef __cplusplus
| extern "C"
| {
| #endif
| /* We use char because int might match the return type of a gcc2
| builtin and then its argument prototype would still apply. */
| char Sleep ();
| /* The GNU C library defines this for functions which it implements
| to always fail with ENOSYS. Some functions are actually named
| something starting with __ and the normal name is an alias. */
| #if defined (__stub_Sleep) || defined (__stub___Sleep)
| choke me
| #else
| char (*f) () = Sleep;
| #endif
| #ifdef __cplusplus
| }
| #endif
|
| int
| main ()
| {
| return f != Sleep;
| ;
| return 0;
| }
configure:10370: result: no
configure:10282: checking for WaitForSingleObject
configure:10339: g++ -o conftest -g -O2 -DBZ_BUILD_DATE=20050510 -ffast-math -fno-exceptions -fsigned-char -Wall -W -Wshadow -mcpu=i686 -L/usr/X11R6/lib conftest.cc -lbind -lm >&5
/tmp/ccKVjG8O.o(.text+0x14): In function `main':
/home/linux/bzflag/conftest.cc:108: undefined reference to `WaitForSingleObject'
/tmp/ccKVjG8O.o(.data+0x0): undefined reference to `WaitForSingleObject'
collect2: ld returned 1 exit status
configure:10345: $? = 1
configure: failed program was:
| /* confdefs.h. */
|
| #define PACKAGE_NAME ""
| #define PACKAGE_TARNAME ""
| #define PACKAGE_VERSION ""
| #define PACKAGE_STRING ""
| #define PACKAGE_BUGREPORT ""
| #define PACKAGE "bzflag"
| #define VERSION "2.0.3.20050510"
| #define BZ_BUILD_OS "linux-gnu"
| #define BZ_BUILD_USER "wili"
| #define BUILD_REGEX 1
| #ifdef __cplusplus
| extern "C" void std::exit (int) throw (); using std::exit;
| #endif
| #define HAVE_CURL 1
| #define STDC_HEADERS 1
| #define HAVE_SYS_TYPES_H 1
| #define HAVE_SYS_STAT_H 1
| #define HAVE_STDLIB_H 1
| #define HAVE_STRING_H 1
| #define HAVE_MEMORY_H 1
| #define HAVE_STRINGS_H 1
| #define HAVE_INTTYPES_H 1
| #define HAVE_STDINT_H 1
| #define HAVE_UNISTD_H 1
| #define HAVE_CSTDLIB 1
| #define HAVE_CSTDIO 1
| #define HAVE_CSTRING 1
| #define HAVE_GL_GLX_H 1
| #define HAVE_SDL_SDL_H 1
| #define HAVE_X11_XLIB_H 1
| #define HAVE_LINUX_INPUT_H 1
| #define HAVE_STDINT_H 1
| #define HAVE_SYS_PARAM_H 1
| #define HAVE_UNISTD_H 1
| #define HAVE_VALUES_H 1
| #define HAVE_SOCKLEN_T 1
| #define HAVE_FF_EFFECT_RUMBLE 1
| #define HAVE_LIBM 1
| #define HAVE_LIBBIND 1
| #define HAVE_ACOSF 1
| #define HAVE_ASINF 1
| #define HAVE_ATAN2F 1
| #define HAVE_ATANF 1
| #define HAVE_COSF 1
| #define HAVE_EXPF 1
| #define HAVE_FABSF 1
| #define HAVE_FLOORF 1
| #define HAVE_FMODF 1
| #define HAVE_HYPOTF 1
| #define HAVE_LOGF 1
| #define HAVE_POWF 1
| #define HAVE_SINF 1
| #define HAVE_SQRTF 1
| #define HAVE_TANF 1
| #define HAVE_REGEX_H 1
| #define HAVE_STD_COUNT 1
| #define HAVE_NCURSES_H
| #define HAVE_SDL 1
| #define ROBOT 1
| #define SNAPPING 1
| #define INSTALL_DATA_DIR "/usr/local/share/bzflag"
| #define HALF_RATE_AUDIO 1
| #define XF86VIDMODE_EXT 1
| #define NDEBUG 1
| /* end confdefs.h. */
| /* Define WaitForSingleObject to an innocuous variant, in case <limits.h> declares WaitForSingleObject.
| For example, HP-UX 11i <limits.h> declares gettimeofday. */
| #define WaitForSingleObject innocuous_WaitForSingleObject
|
| /* System header to define __stub macros and hopefully few prototypes,
| which can conflict with char WaitForSingleObject (); below.
| Prefer <limits.h> to <assert.h> if __STDC__ is defined, since
| <limits.h> exists even on freestanding compilers. */
|
| #ifdef __STDC__
| # include <limits.h>
| #else
| # include <assert.h>
| #endif
|
| #undef WaitForSingleObject
|
| /* Override any gcc2 internal prototype to avoid an error. */
| #ifdef __cplusplus
| extern "C"
| {
| #endif
| /* We use char because int might match the return type of a gcc2
| builtin and then its argument prototype would still apply. */
| char WaitForSingleObject ();
| /* The GNU C library defines this for functions which it implements
| to always fail with ENOSYS. Some functions are actually named
| something starting with __ and the normal name is an alias. */
| #if defined (__stub_WaitForSingleObject) || defined (__stub___WaitForSingleObject)
| choke me
| #else
| char (*f) () = WaitForSingleObject;
| #endif
| #ifdef __cplusplus
| }
| #endif
|
| int
| main ()
| {
| return f != WaitForSingleObject;
| ;
| return 0;
| }
configure:10370: result: no
configure:10282: checking for _stricmp
configure:10339: g++ -o conftest -g -O2 -DBZ_BUILD_DATE=20050510 -ffast-math -fno-exceptions -fsigned-char -Wall -W -Wshadow -mcpu=i686 -L/usr/X11R6/lib conftest.cc -lbind -lm >&5
/tmp/ccA4uob7.o(.text+0x14): In function `main':
/home/linux/bzflag/conftest.cc:108: undefined reference to `_stricmp'
/tmp/ccA4uob7.o(.data+0x0): undefined reference to `_stricmp'
collect2: ld returned 1 exit status
configure:10345: $? = 1
configure: failed program was:
| /* confdefs.h. */
|
| #define PACKAGE_NAME ""
| #define PACKAGE_TARNAME ""
| #define PACKAGE_VERSION ""
| #define PACKAGE_STRING ""
| #define PACKAGE_BUGREPORT ""
| #define PACKAGE "bzflag"
| #define VERSION "2.0.3.20050510"
| #define BZ_BUILD_OS "linux-gnu"
| #define BZ_BUILD_USER "wili"
| #define BUILD_REGEX 1
| #ifdef __cplusplus
| extern "C" void std::exit (int) throw (); using std::exit;
| #endif
| #define HAVE_CURL 1
| #define STDC_HEADERS 1
| #define HAVE_SYS_TYPES_H 1
| #define HAVE_SYS_STAT_H 1
| #define HAVE_STDLIB_H 1
| #define HAVE_STRING_H 1
| #define HAVE_MEMORY_H 1
| #define HAVE_STRINGS_H 1
| #define HAVE_INTTYPES_H 1
| #define HAVE_STDINT_H 1
| #define HAVE_UNISTD_H 1
| #define HAVE_CSTDLIB 1
| #define HAVE_CSTDIO 1
| #define HAVE_CSTRING 1
| #define HAVE_GL_GLX_H 1
| #define HAVE_SDL_SDL_H 1
| #define HAVE_X11_XLIB_H 1
| #define HAVE_LINUX_INPUT_H 1
| #define HAVE_STDINT_H 1
| #define HAVE_SYS_PARAM_H 1
| #define HAVE_UNISTD_H 1
| #define HAVE_VALUES_H 1
| #define HAVE_SOCKLEN_T 1
| #define HAVE_FF_EFFECT_RUMBLE 1
| #define HAVE_LIBM 1
| #define HAVE_LIBBIND 1
| #define HAVE_ACOSF 1
| #define HAVE_ASINF 1
| #define HAVE_ATAN2F 1
| #define HAVE_ATANF 1
| #define HAVE_COSF 1
| #define HAVE_EXPF 1
| #define HAVE_FABSF 1
| #define HAVE_FLOORF 1
| #define HAVE_FMODF 1
| #define HAVE_HYPOTF 1
| #define HAVE_LOGF 1
| #define HAVE_POWF 1
| #define HAVE_SINF 1
| #define HAVE_SQRTF 1
| #define HAVE_TANF 1
| #define HAVE_REGEX_H 1
| #define HAVE_STD_COUNT 1
| #define HAVE_NCURSES_H
| #define HAVE_SDL 1
| #define ROBOT 1
| #define SNAPPING 1
| #define INSTALL_DATA_DIR "/usr/local/share/bzflag"
| #define HALF_RATE_AUDIO 1
| #define XF86VIDMODE_EXT 1
| #define NDEBUG 1
| /* end confdefs.h. */
| /* Define _stricmp to an innocuous variant, in case <limits.h> declares _stricmp.
| For example, HP-UX 11i <limits.h> declares gettimeofday. */
| #define _stricmp innocuous__stricmp
|
| /* System header to define __stub macros and hopefully few prototypes,
| which can conflict with char _stricmp (); below.
| Prefer <limits.h> to <assert.h> if __STDC__ is defined, since
| <limits.h> exists even on freestanding compilers. */
|
| #ifdef __STDC__
| # include <limits.h>
| #else
| # include <assert.h>
| #endif
|
| #undef _stricmp
|
| /* Override any gcc2 internal prototype to avoid an error. */
| #ifdef __cplusplus
| extern "C"
| {
| #endif
| /* We use char because int might match the return type of a gcc2
| builtin and then its argument prototype would still apply. */
| char _stricmp ();
| /* The GNU C library defines this for functions which it implements
| to always fail with ENOSYS. Some functions are actually named
| something starting with __ and the normal name is an alias. */
| #if defined (__stub__stricmp) || defined (__stub____stricmp)
| choke me
| #else
| char (*f) () = _stricmp;
| #endif
| #ifdef __cplusplus
| }
| #endif
|
| int
| main ()
| {
| return f != _stricmp;
| ;
| return 0;
| }
configure:10370: result: no
configure:10282: checking for _strnicmp
configure:10339: g++ -o conftest -g -O2 -DBZ_BUILD_DATE=20050510 -ffast-math -fno-exceptions -fsigned-char -Wall -W -Wshadow -mcpu=i686 -L/usr/X11R6/lib conftest.cc -lbind -lm >&5
/tmp/cc8xdO3m.o(.text+0x14): In function `main':
/home/linux/bzflag/conftest.cc:108: undefined reference to `_strnicmp'
/tmp/cc8xdO3m.o(.data+0x0): undefined reference to `_strnicmp'
collect2: ld returned 1 exit status
configure:10345: $? = 1
configure: failed program was:
| /* confdefs.h. */
|
| #define PACKAGE_NAME ""
| #define PACKAGE_TARNAME ""
| #define PACKAGE_VERSION ""
| #define PACKAGE_STRING ""
| #define PACKAGE_BUGREPORT ""
| #define PACKAGE "bzflag"
| #define VERSION "2.0.3.20050510"
| #define BZ_BUILD_OS "linux-gnu"
| #define BZ_BUILD_USER "wili"
| #define BUILD_REGEX 1
| #ifdef __cplusplus
| extern "C" void std::exit (int) throw (); using std::exit;
| #endif
| #define HAVE_CURL 1
| #define STDC_HEADERS 1
| #define HAVE_SYS_TYPES_H 1
| #define HAVE_SYS_STAT_H 1
| #define HAVE_STDLIB_H 1
| #define HAVE_STRING_H 1
| #define HAVE_MEMORY_H 1
| #define HAVE_STRINGS_H 1
| #define HAVE_INTTYPES_H 1
| #define HAVE_STDINT_H 1
| #define HAVE_UNISTD_H 1
| #define HAVE_CSTDLIB 1
| #define HAVE_CSTDIO 1
| #define HAVE_CSTRING 1
| #define HAVE_GL_GLX_H 1
| #define HAVE_SDL_SDL_H 1
| #define HAVE_X11_XLIB_H 1
| #define HAVE_LINUX_INPUT_H 1
| #define HAVE_STDINT_H 1
| #define HAVE_SYS_PARAM_H 1
| #define HAVE_UNISTD_H 1
| #define HAVE_VALUES_H 1
| #define HAVE_SOCKLEN_T 1
| #define HAVE_FF_EFFECT_RUMBLE 1
| #define HAVE_LIBM 1
| #define HAVE_LIBBIND 1
| #define HAVE_ACOSF 1
| #define HAVE_ASINF 1
| #define HAVE_ATAN2F 1
| #define HAVE_ATANF 1
| #define HAVE_COSF 1
| #define HAVE_EXPF 1
| #define HAVE_FABSF 1
| #define HAVE_FLOORF 1
| #define HAVE_FMODF 1
| #define HAVE_HYPOTF 1
| #define HAVE_LOGF 1
| #define HAVE_POWF 1
| #define HAVE_SINF 1
| #define HAVE_SQRTF 1
| #define HAVE_TANF 1
| #define HAVE_REGEX_H 1
| #define HAVE_STD_COUNT 1
| #define HAVE_NCURSES_H
| #define HAVE_SDL 1
| #define ROBOT 1
| #define SNAPPING 1
| #define INSTALL_DATA_DIR "/usr/local/share/bzflag"
| #define HALF_RATE_AUDIO 1
| #define XF86VIDMODE_EXT 1
| #define NDEBUG 1
| /* end confdefs.h. */
| /* Define _strnicmp to an innocuous variant, in case <limits.h> declares _strnicmp.
| For example, HP-UX 11i <limits.h> declares gettimeofday. */
| #define _strnicmp innocuous__strnicmp
|
| /* System header to define __stub macros and hopefully few prototypes,
| which can conflict with char _strnicmp (); below.
| Prefer <limits.h> to <assert.h> if __STDC__ is defined, since
| <limits.h> exists even on freestanding compilers. */
|
| #ifdef __STDC__
| # include <limits.h>
| #else
| # include <assert.h>
| #endif
|
| #undef _strnicmp
|
| /* Override any gcc2 internal prototype to avoid an error. */
| #ifdef __cplusplus
| extern "C"
| {
| #endif
| /* We use char because int might match the return type of a gcc2
| builtin and then its argument prototype would still apply. */
| char _strnicmp ();
| /* The GNU C library defines this for functions which it implements
| to always fail with ENOSYS. Some functions are actually named
| something starting with __ and the normal name is an alias. */
| #if defined (__stub__strnicmp) || defined (__stub____strnicmp)
| choke me
| #else
| char (*f) () = _strnicmp;
| #endif
| #ifdef __cplusplus
| }
| #endif
|
| int
| main ()
| {
| return f != _strnicmp;
| ;
| return 0;
| }
configure:10370: result: no
configure:10282: checking for _vsnprintf
configure:10339: g++ -o conftest -g -O2 -DBZ_BUILD_DATE=20050510 -ffast-math -fno-exceptions -fsigned-char -Wall -W -Wshadow -mcpu=i686 -L/usr/X11R6/lib conftest.cc -lbind -lm >&5
/tmp/ccG7UhlA.o(.text+0x14): In function `main':
/home/linux/bzflag/conftest.cc:108: undefined reference to `_vsnprintf'
/tmp/ccG7UhlA.o(.data+0x0): undefined reference to `_vsnprintf'
collect2: ld returned 1 exit status
configure:10345: $? = 1
configure: failed program was:
| /* confdefs.h. */
|
| #define PACKAGE_NAME ""
| #define PACKAGE_TARNAME ""
| #define PACKAGE_VERSION ""
| #define PACKAGE_STRING ""
| #define PACKAGE_BUGREPORT ""
| #define PACKAGE "bzflag"
| #define VERSION "2.0.3.20050510"
| #define BZ_BUILD_OS "linux-gnu"
| #define BZ_BUILD_USER "wili"
| #define BUILD_REGEX 1
| #ifdef __cplusplus
| extern "C" void std::exit (int) throw (); using std::exit;
| #endif
| #define HAVE_CURL 1
| #define STDC_HEADERS 1
| #define HAVE_SYS_TYPES_H 1
| #define HAVE_SYS_STAT_H 1
| #define HAVE_STDLIB_H 1
| #define HAVE_STRING_H 1
| #define HAVE_MEMORY_H 1
| #define HAVE_STRINGS_H 1
| #define HAVE_INTTYPES_H 1
| #define HAVE_STDINT_H 1
| #define HAVE_UNISTD_H 1
| #define HAVE_CSTDLIB 1
| #define HAVE_CSTDIO 1
| #define HAVE_CSTRING 1
| #define HAVE_GL_GLX_H 1
| #define HAVE_SDL_SDL_H 1
| #define HAVE_X11_XLIB_H 1
| #define HAVE_LINUX_INPUT_H 1
| #define HAVE_STDINT_H 1
| #define HAVE_SYS_PARAM_H 1
| #define HAVE_UNISTD_H 1
| #define HAVE_VALUES_H 1
| #define HAVE_SOCKLEN_T 1
| #define HAVE_FF_EFFECT_RUMBLE 1
| #define HAVE_LIBM 1
| #define HAVE_LIBBIND 1
| #define HAVE_ACOSF 1
| #define HAVE_ASINF 1
| #define HAVE_ATAN2F 1
| #define HAVE_ATANF 1
| #define HAVE_COSF 1
| #define HAVE_EXPF 1
| #define HAVE_FABSF 1
| #define HAVE_FLOORF 1
| #define HAVE_FMODF 1
| #define HAVE_HYPOTF 1
| #define HAVE_LOGF 1
| #define HAVE_POWF 1
| #define HAVE_SINF 1
| #define HAVE_SQRTF 1
| #define HAVE_TANF 1
| #define HAVE_REGEX_H 1
| #define HAVE_STD_COUNT 1
| #define HAVE_NCURSES_H
| #define HAVE_SDL 1
| #define ROBOT 1
| #define SNAPPING 1
| #define INSTALL_DATA_DIR "/usr/local/share/bzflag"
| #define HALF_RATE_AUDIO 1
| #define XF86VIDMODE_EXT 1
| #define NDEBUG 1
| /* end confdefs.h. */
| /* Define _vsnprintf to an innocuous variant, in case <limits.h> declares _vsnprintf.
| For example, HP-UX 11i <limits.h> declares gettimeofday. */
| #define _vsnprintf innocuous__vsnprintf
|
| /* System header to define __stub macros and hopefully few prototypes,
| which can conflict with char _vsnprintf (); below.
| Prefer <limits.h> to <assert.h> if __STDC__ is defined, since
| <limits.h> exists even on freestanding compilers. */
|
| #ifdef __STDC__
| # include <limits.h>
| #else
| # include <assert.h>
| #endif
|
| #undef _vsnprintf
|
| /* Override any gcc2 internal prototype to avoid an error. */
| #ifdef __cplusplus
| extern "C"
| {
| #endif
| /* We use char because int might match the return type of a gcc2
| builtin and then its argument prototype would still apply. */
| char _vsnprintf ();
| /* The GNU C library defines this for functions which it implements
| to always fail with ENOSYS. Some functions are actually named
| something starting with __ and the normal name is an alias. */
| #if defined (__stub__vsnprintf) || defined (__stub____vsnprintf)
| choke me
| #else
| char (*f) () = _vsnprintf;
| #endif
| #ifdef __cplusplus
| }
| #endif
|
| int
| main ()
| {
| return f != _vsnprintf;
| ;
| return 0;
| }
configure:10370: result: no
configure:10282: checking for atexit
configure:10339: g++ -o conftest -g -O2 -DBZ_BUILD_DATE=20050510 -ffast-math -fno-exceptions -fsigned-char -Wall -W -Wshadow -mcpu=i686 -L/usr/X11R6/lib conftest.cc -lbind -lm >&5
configure:10345: $? = 0
configure:10349: test -z
|| test ! -s conftest.err
configure:10352: $? = 0
configure:10355: test -s conftest
configure:10358: $? = 0
configure:10370: result: yes
configure:10282: checking for getrlimit
configure:10339: g++ -o conftest -g -O2 -DBZ_BUILD_DATE=20050510 -ffast-math -fno-exceptions -fsigned-char -Wall -W -Wshadow -mcpu=i686 -L/usr/X11R6/lib conftest.cc -lbind -lm >&5
configure:10345: $? = 0
configure:10349: test -z
|| test ! -s conftest.err
configure:10352: $? = 0
configure:10355: test -s conftest
configure:10358: $? = 0
configure:10370: result: yes
configure:10282: checking for glXGetCurrentContext
configure:10339: g++ -o conftest -g -O2 -DBZ_BUILD_DATE=20050510 -ffast-math -fno-exceptions -fsigned-char -Wall -W -Wshadow -mcpu=i686 -L/usr/X11R6/lib conftest.cc -lbind -lm >&5
/tmp/ccK1wesq.o(.text+0x14): In function `main':
/home/linux/bzflag/conftest.cc:110: undefined reference to `glXGetCurrentContext'
/tmp/ccK1wesq.o(.data+0x0): undefined reference to `glXGetCurrentContext'
collect2: ld returned 1 exit status
configure:10345: $? = 1
configure: failed program was:
| /* confdefs.h. */
|
| #define PACKAGE_NAME ""
| #define PACKAGE_TARNAME ""
| #define PACKAGE_VERSION ""
| #define PACKAGE_STRING ""
| #define PACKAGE_BUGREPORT ""
| #define PACKAGE "bzflag"
| #define VERSION "2.0.3.20050510"
| #define BZ_BUILD_OS "linux-gnu"
| #define BZ_BUILD_USER "wili"
| #define BUILD_REGEX 1
| #ifdef __cplusplus
| extern "C" void std::exit (int) throw (); using std::exit;
| #endif
| #define HAVE_CURL 1
| #define STDC_HEADERS 1
| #define HAVE_SYS_TYPES_H 1
| #define HAVE_SYS_STAT_H 1
| #define HAVE_STDLIB_H 1
| #define HAVE_STRING_H 1
| #define HAVE_MEMORY_H 1
| #define HAVE_STRINGS_H 1
| #define HAVE_INTTYPES_H 1
| #define HAVE_STDINT_H 1
| #define HAVE_UNISTD_H 1
| #define HAVE_CSTDLIB 1
| #define HAVE_CSTDIO 1
| #define HAVE_CSTRING 1
| #define HAVE_GL_GLX_H 1
| #define HAVE_SDL_SDL_H 1
| #define HAVE_X11_XLIB_H 1
| #define HAVE_LINUX_INPUT_H 1
| #define HAVE_STDINT_H 1
| #define HAVE_SYS_PARAM_H 1
| #define HAVE_UNISTD_H 1
| #define HAVE_VALUES_H 1
| #define HAVE_SOCKLEN_T 1
| #define HAVE_FF_EFFECT_RUMBLE 1
| #define HAVE_LIBM 1
| #define HAVE_LIBBIND 1
| #define HAVE_ACOSF 1
| #define HAVE_ASINF 1
| #define HAVE_ATAN2F 1
| #define HAVE_ATANF 1
| #define HAVE_COSF 1
| #define HAVE_EXPF 1
| #define HAVE_FABSF 1
| #define HAVE_FLOORF 1
| #define HAVE_FMODF 1
| #define HAVE_HYPOTF 1
| #define HAVE_LOGF 1
| #define HAVE_POWF 1
| #define HAVE_SINF 1
| #define HAVE_SQRTF 1
| #define HAVE_TANF 1
| #define HAVE_REGEX_H 1
| #define HAVE_STD_COUNT 1
| #define HAVE_NCURSES_H
| #define HAVE_SDL 1
| #define ROBOT 1
| #define SNAPPING 1
| #define INSTALL_DATA_DIR "/usr/local/share/bzflag"
| #define HALF_RATE_AUDIO 1
| #define XF86VIDMODE_EXT 1
| #define NDEBUG 1
| #define HAVE_ATEXIT 1
| #define HAVE_GETRLIMIT 1
| /* end confdefs.h. */
| /* Define glXGetCurrentContext to an innocuous variant, in case <limits.h> declares glXGetCurrentContext.
| For example, HP-UX 11i <limits.h> declares gettimeofday. */
| #define glXGetCurrentContext innocuous_glXGetCurrentContext
|
| /* System header to define __stub macros and hopefully few prototypes,
| which can conflict with char glXGetCurrentContext (); below.
| Prefer <limits.h> to <assert.h> if __STDC__ is defined, since
| <limits.h> exists even on freestanding compilers. */
|
| #ifdef __STDC__
| # include <limits.h>
| #else
| # include <assert.h>
| #endif
|
| #undef glXGetCurrentContext
|
| /* Override any gcc2 internal prototype to avoid an error. */
| #ifdef __cplusplus
| extern "C"
| {
| #endif
| /* We use char because int might match the return type of a gcc2
| builtin and then its argument prototype would still apply. */
| char glXGetCurrentContext ();
| /* The GNU C library defines this for functions which it implements
| to always fail with ENOSYS. Some functions are actually named
| something starting with __ and the normal name is an alias. */
| #if defined (__stub_glXGetCurrentContext) || defined (__stub___glXGetCurrentContext)
| choke me
| #else
| char (*f) () = glXGetCurrentContext;
| #endif
| #ifdef __cplusplus
| }
| #endif
|
| int
| main ()
| {
| return f != glXGetCurrentContext;
| ;
| return 0;
| }
configure:10370: result: no
configure:10282: checking for select
configure:10339: g++ -o conftest -g -O2 -DBZ_BUILD_DATE=20050510 -ffast-math -fno-exceptions -fsigned-char -Wall -W -Wshadow -mcpu=i686 -L/usr/X11R6/lib conftest.cc -lbind -lm >&5
configure:10345: $? = 0
configure:10349: test -z
|| test ! -s conftest.err
configure:10352: $? = 0
configure:10355: test -s conftest
configure:10358: $? = 0
configure:10370: result: yes
configure:10282: checking for snooze
configure:10339: g++ -o conftest -g -O2 -DBZ_BUILD_DATE=20050510 -ffast-math -fno-exceptions -fsigned-char -Wall -W -Wshadow -mcpu=i686 -L/usr/X11R6/lib conftest.cc -lbind -lm >&5
/tmp/cc08yvpE.o(.text+0x14): In function `main':
/home/linux/bzflag/conftest.cc:111: undefined reference to `snooze'
/tmp/cc08yvpE.o(.data+0x0): undefined reference to `snooze'
collect2: ld returned 1 exit status
configure:10345: $? = 1
configure: failed program was:
| /* confdefs.h. */
|
| #define PACKAGE_NAME ""
| #define PACKAGE_TARNAME ""
| #define PACKAGE_VERSION ""
| #define PACKAGE_STRING ""
| #define PACKAGE_BUGREPORT ""
| #define PACKAGE "bzflag"
| #define VERSION "2.0.3.20050510"
| #define BZ_BUILD_OS "linux-gnu"
| #define BZ_BUILD_USER "wili"
| #define BUILD_REGEX 1
| #ifdef __cplusplus
| extern "C" void std::exit (int) throw (); using std::exit;
| #endif
| #define HAVE_CURL 1
| #define STDC_HEADERS 1
| #define HAVE_SYS_TYPES_H 1
| #define HAVE_SYS_STAT_H 1
| #define HAVE_STDLIB_H 1
| #define HAVE_STRING_H 1
| #define HAVE_MEMORY_H 1
| #define HAVE_STRINGS_H 1
| #define HAVE_INTTYPES_H 1
| #define HAVE_STDINT_H 1
| #define HAVE_UNISTD_H 1
| #define HAVE_CSTDLIB 1
| #define HAVE_CSTDIO 1
| #define HAVE_CSTRING 1
| #define HAVE_GL_GLX_H 1
| #define HAVE_SDL_SDL_H 1
| #define HAVE_X11_XLIB_H 1
| #define HAVE_LINUX_INPUT_H 1
| #define HAVE_STDINT_H 1
| #define HAVE_SYS_PARAM_H 1
| #define HAVE_UNISTD_H 1
| #define HAVE_VALUES_H 1
| #define HAVE_SOCKLEN_T 1
| #define HAVE_FF_EFFECT_RUMBLE 1
| #define HAVE_LIBM 1
| #define HAVE_LIBBIND 1
| #define HAVE_ACOSF 1
| #define HAVE_ASINF 1
| #define HAVE_ATAN2F 1
| #define HAVE_ATANF 1
| #define HAVE_COSF 1
| #define HAVE_EXPF 1
| #define HAVE_FABSF 1
| #define HAVE_FLOORF 1
| #define HAVE_FMODF 1
| #define HAVE_HYPOTF 1
| #define HAVE_LOGF 1
| #define HAVE_POWF 1
| #define HAVE_SINF 1
| #define HAVE_SQRTF 1
| #define HAVE_TANF 1
| #define HAVE_REGEX_H 1
| #define HAVE_STD_COUNT 1
| #define HAVE_NCURSES_H
| #define HAVE_SDL 1
| #define ROBOT 1
| #define SNAPPING 1
| #define INSTALL_DATA_DIR "/usr/local/share/bzflag"
| #define HALF_RATE_AUDIO 1
| #define XF86VIDMODE_EXT 1
| #define NDEBUG 1
| #define HAVE_ATEXIT 1
| #define HAVE_GETRLIMIT 1
| #define HAVE_SELECT 1
| /* end confdefs.h. */
| /* Define snooze to an innocuous variant, in case <limits.h> declares snooze.
| For example, HP-UX 11i <limits.h> declares gettimeofday. */
| #define snooze innocuous_snooze
|
| /* System header to define __stub macros and hopefully few prototypes,
| which can conflict with char snooze (); below.
| Prefer <limits.h> to <assert.h> if __STDC__ is defined, since
| <limits.h> exists even on freestanding compilers. */
|
| #ifdef __STDC__
| # include <limits.h>
| #else
| # include <assert.h>
| #endif
|
| #undef snooze
|
| /* Override any gcc2 internal prototype to avoid an error. */
| #ifdef __cplusplus
| extern "C"
| {
| #endif
| /* We use char because int might match the return type of a gcc2
| builtin and then its argument prototype would still apply. */
| char snooze ();
| /* The GNU C library defines this for functions which it implements
| to always fail with ENOSYS. Some functions are actually named
| something starting with __ and the normal name is an alias. */
| #if defined (__stub_snooze) || defined (__stub___snooze)
| choke me
| #else
| char (*f) () = snooze;
| #endif
| #ifdef __cplusplus
| }
| #endif
|
| int
| main ()
| {
| return f != snooze;
| ;
| return 0;
| }
configure:10370: result: no
configure:10282: checking for usleep
configure:10339: g++ -o conftest -g -O2 -DBZ_BUILD_DATE=20050510 -ffast-math -fno-exceptions -fsigned-char -Wall -W -Wshadow -mcpu=i686 -L/usr/X11R6/lib conftest.cc -lbind -lm >&5
configure:10345: $? = 0
configure:10349: test -z
|| test ! -s conftest.err
configure:10352: $? = 0
configure:10355: test -s conftest
configure:10358: $? = 0
configure:10370: result: yes
configure:10282: checking for vsnprintf
configure:10339: g++ -o conftest -g -O2 -DBZ_BUILD_DATE=20050510 -ffast-math -fno-exceptions -fsigned-char -Wall -W -Wshadow -mcpu=i686 -L/usr/X11R6/lib conftest.cc -lbind -lm >&5
configure:10345: $? = 0
configure:10349: test -z
|| test ! -s conftest.err
configure:10352: $? = 0
configure:10355: test -s conftest
configure:10358: $? = 0
configure:10370: result: yes
configure:10282: checking for wglGetCurrentContext
configure:10339: g++ -o conftest -g -O2 -DBZ_BUILD_DATE=20050510 -ffast-math -fno-exceptions -fsigned-char -Wall -W -Wshadow -mcpu=i686 -L/usr/X11R6/lib conftest.cc -lbind -lm >&5
/tmp/ccMA6hAr.o(.text+0x14): In function `main':
/home/linux/bzflag/conftest.cc:113: undefined reference to `wglGetCurrentContext'
/tmp/ccMA6hAr.o(.data+0x0): undefined reference to `wglGetCurrentContext'
collect2: ld returned 1 exit status
configure:10345: $? = 1
configure: failed program was:
| /* confdefs.h. */
|
| #define PACKAGE_NAME ""
| #define PACKAGE_TARNAME ""
| #define PACKAGE_VERSION ""
| #define PACKAGE_STRING ""
| #define PACKAGE_BUGREPORT ""
| #define PACKAGE "bzflag"
| #define VERSION "2.0.3.20050510"
| #define BZ_BUILD_OS "linux-gnu"
| #define BZ_BUILD_USER "wili"
| #define BUILD_REGEX 1
| #ifdef __cplusplus
| extern "C" void std::exit (int) throw (); using std::exit;
| #endif
| #define HAVE_CURL 1
| #define STDC_HEADERS 1
| #define HAVE_SYS_TYPES_H 1
| #define HAVE_SYS_STAT_H 1
| #define HAVE_STDLIB_H 1
| #define HAVE_STRING_H 1
| #define HAVE_MEMORY_H 1
| #define HAVE_STRINGS_H 1
| #define HAVE_INTTYPES_H 1
| #define HAVE_STDINT_H 1
| #define HAVE_UNISTD_H 1
| #define HAVE_CSTDLIB 1
| #define HAVE_CSTDIO 1
| #define HAVE_CSTRING 1
| #define HAVE_GL_GLX_H 1
| #define HAVE_SDL_SDL_H 1
| #define HAVE_X11_XLIB_H 1
| #define HAVE_LINUX_INPUT_H 1
| #define HAVE_STDINT_H 1
| #define HAVE_SYS_PARAM_H 1
| #define HAVE_UNISTD_H 1
| #define HAVE_VALUES_H 1
| #define HAVE_SOCKLEN_T 1
| #define HAVE_FF_EFFECT_RUMBLE 1
| #define HAVE_LIBM 1
| #define HAVE_LIBBIND 1
| #define HAVE_ACOSF 1
| #define HAVE_ASINF 1
| #define HAVE_ATAN2F 1
| #define HAVE_ATANF 1
| #define HAVE_COSF 1
| #define HAVE_EXPF 1
| #define HAVE_FABSF 1
| #define HAVE_FLOORF 1
| #define HAVE_FMODF 1
| #define HAVE_HYPOTF 1
| #define HAVE_LOGF 1
| #define HAVE_POWF 1
| #define HAVE_SINF 1
| #define HAVE_SQRTF 1
| #define HAVE_TANF 1
| #define HAVE_REGEX_H 1
| #define HAVE_STD_COUNT 1
| #define HAVE_NCURSES_H
| #define HAVE_SDL 1
| #define ROBOT 1
| #define SNAPPING 1
| #define INSTALL_DATA_DIR "/usr/local/share/bzflag"
| #define HALF_RATE_AUDIO 1
| #define XF86VIDMODE_EXT 1
| #define NDEBUG 1
| #define HAVE_ATEXIT 1
| #define HAVE_GETRLIMIT 1
| #define HAVE_SELECT 1
| #define HAVE_USLEEP 1
| #define HAVE_VSNPRINTF 1
| /* end confdefs.h. */
| /* Define wglGetCurrentContext to an innocuous variant, in case <limits.h> declares wglGetCurrentContext.
| For example, HP-UX 11i <limits.h> declares gettimeofday. */
| #define wglGetCurrentContext innocuous_wglGetCurrentContext
|
| /* System header to define __stub macros and hopefully few prototypes,
| which can conflict with char wglGetCurrentContext (); below.
| Prefer <limits.h> to <assert.h> if __STDC__ is defined, since
| <limits.h> exists even on freestanding compilers. */
|
| #ifdef __STDC__
| # include <limits.h>
| #else
| # include <assert.h>
| #endif
|
| #undef wglGetCurrentContext
|
| /* Override any gcc2 internal prototype to avoid an error. */
| #ifdef __cplusplus
| extern "C"
| {
| #endif
| /* We use char because int might match the return type of a gcc2
| builtin and then its argument prototype would still apply. */
| char wglGetCurrentContext ();
| /* The GNU C library defines this for functions which it implements
| to always fail with ENOSYS. Some functions are actually named
| something starting with __ and the normal name is an alias. */
| #if defined (__stub_wglGetCurrentContext) || defined (__stub___wglGetCurrentContext)
| choke me
| #else
| char (*f) () = wglGetCurrentContext;
| #endif
| #ifdef __cplusplus
| }
| #endif
|
| int
| main ()
| {
| return f != wglGetCurrentContext;
| ;
| return 0;
| }
configure:10370: result: no
configure:10694: creating ./config.status
## ---------------------- ##
## Running config.status. ##
## ---------------------- ##
This file was extended by config.status, which was
generated by GNU Autoconf 2.59. Invocation command line was
CONFIG_FILES =
CONFIG_HEADERS =
CONFIG_LINKS =
CONFIG_COMMANDS =
$ ./config.status
on piko.hoomaha.net
config.status:837: creating bzflag.info
config.status:837: creating bzflag.lsm
config.status:837: creating BZFlag.xcode/Makefile
config.status:837: creating Dev-C++/Makefile
config.status:837: creating Makefile
config.status:837: creating bzflag.spec
config.status:837: creating data/Makefile
config.status:837: creating data/fonts/Makefile
config.status:837: creating data/l10n/Makefile
config.status:837: creating debian/Makefile
config.status:837: creating doc/Makefile
config.status:837: creating doc/faq/Makefile
config.status:837: creating doc/guide/Makefile
config.status:837: creating doc/guide/Commands/Makefile
config.status:837: creating doc/guide/Flags/Makefile
config.status:837: creating doc/guide/Geometry/Makefile
config.status:837: creating doc/guide/Installation/Makefile
config.status:837: creating doc/guide/Tactics/Makefile
config.status:837: creating doc/howto/Makefile
config.status:837: creating doc/man/Makefile
config.status:837: creating include/Makefile
config.status:837: creating misc/Makefile
config.status:837: creating man/Makefile
config.status:837: creating package/Makefile
config.status:837: creating package/linux/Makefile
config.status:837: creating package/rpm/Makefile
config.status:837: creating package/irix/Makefile
config.status:837: creating package/win32/Makefile
config.status:837: creating package/win32/nsis/Makefile
config.status:837: creating src/Makefile
config.status:837: creating src/bzadmin/Makefile
config.status:837: creating src/bzflag/Makefile
config.status:837: creating src/bzfs/Makefile
config.status:837: creating src/c-ares/Makefile
config.status:837: creating src/common/Makefile
config.status:837: creating src/date/Makefile
config.status:837: creating src/3D/Makefile
config.status:837: creating src/game/Makefile
config.status:837: creating src/geometry/Makefile
config.status:837: creating src/geometry/models/Makefile
config.status:837: creating src/geometry/models/tank/Makefile
config.status:837: creating src/mediafile/Makefile
config.status:837: creating src/net/Makefile
config.status:837: creating src/obstacle/Makefile
config.status:837: creating src/ogl/Makefile
config.status:837: creating src/platform/Makefile
config.status:837: creating src/platform/MacOSX/BZFlag-Info.plist
config.status:837: creating src/platform/MacOSX/Makefile
config.status:837: creating src/regex/Makefile
config.status:837: creating src/scene/Makefile
config.status:837: creating src/zlib/Makefile
config.status:837: creating tools/Makefile
config.status:837: creating tools/TextTool-W32/Makefile
config.status:837: creating tools/TextTool-W32/res/Makefile
config.status:837: creating tools/bzwtransform/Makefile
config.status:837: creating tools/modeltool/Makefile
config.status:837: creating tools/modeltool/vc71/Makefile
config.status:837: creating win32/Makefile
config.status:837: creating win32/VC6/Makefile
config.status:837: creating win32/VC71/Makefile
config.status:941: creating include/config.h
config.status:1343: executing depfiles commands
configure:12135: result:
configure:12137: result: BZFlag-2.0.3.20050510 with the following:
configure:12143: result: curses: -lncurses
configure:12150: result: SDL
configure:12157: result: bzadmin
configure:12164: result: bzflag client
## ---------------- ##
## Cache variables. ##
## ---------------- ##
ac_cv_build=i686-pc-linux-gnu
ac_cv_build_alias=i686-pc-linux-gnu
ac_cv_c_compiler_gnu=yes
ac_cv_c_const=yes
ac_cv_cxx_compiler_gnu=yes
ac_cv_env_CC_set=
ac_cv_env_CC_value=
ac_cv_env_CFLAGS_set=
ac_cv_env_CFLAGS_value=
ac_cv_env_CPPFLAGS_set=
ac_cv_env_CPPFLAGS_value=
ac_cv_env_CPP_set=
ac_cv_env_CPP_value=
ac_cv_env_CXXCPP_set=
ac_cv_env_CXXCPP_value=
ac_cv_env_CXXFLAGS_set=
ac_cv_env_CXXFLAGS_value=
ac_cv_env_CXX_set=
ac_cv_env_CXX_value=
ac_cv_env_LDFLAGS_set=
ac_cv_env_LDFLAGS_value=
ac_cv_env_build_alias_set=
ac_cv_env_build_alias_value=
ac_cv_env_host_alias_set=
ac_cv_env_host_alias_value=
ac_cv_env_target_alias_set=
ac_cv_env_target_alias_value=
ac_cv_exeext=
ac_cv_func_CGLGetCurrentContext=no
ac_cv_func_Sleep=no
ac_cv_func_WaitForSingleObject=no
ac_cv_func__stricmp=no
ac_cv_func__strnicmp=no
ac_cv_func__vsnprintf=no
ac_cv_func_atexit=yes
ac_cv_func_connect=yes
ac_cv_func_gethostbyname=yes
ac_cv_func_getrlimit=yes
ac_cv_func_glXGetCurrentContext=no
ac_cv_func_remove=yes
ac_cv_func_select=yes
ac_cv_func_shmat=yes
ac_cv_func_snooze=no
ac_cv_func_usleep=yes
ac_cv_func_vsnprintf=yes
ac_cv_func_wglGetCurrentContext=no
ac_cv_have_x='have_x=yes ac_x_includes=/usr/X11R6/include ac_x_libraries=/usr/X11R6/lib'
ac_cv_header_GL_glx_h=yes
ac_cv_header_SDL_SDL_h=yes
ac_cv_header_X11_Xlib_h=yes
ac_cv_header_bstring_h=no
ac_cv_header_cstdio=yes
ac_cv_header_cstdlib=yes
ac_cv_header_cstring=yes
ac_cv_header_inttypes_h=yes
ac_cv_header_linux_input_h=yes
ac_cv_header_memory_h=yes
ac_cv_header_stdc=yes
ac_cv_header_stdint_h=yes
ac_cv_header_stdlib_h=yes
ac_cv_header_string_h=yes
ac_cv_header_strings_h=yes
ac_cv_header_sys_param_h=yes
ac_cv_header_sys_stat_h=yes
ac_cv_header_sys_types_h=yes
ac_cv_header_unistd_h=yes
ac_cv_header_values_h=yes
ac_cv_host=i686-pc-linux-gnu
ac_cv_host_alias=i686-pc-linux-gnu
ac_cv_lib_ICE_IceConnectionNumber=yes
ac_cv_lib_Xext_XextAddDisplay=yes
ac_cv_lib_Xi_XListInputDevices=yes
ac_cv_lib_Xxf86vm_XF86VidModeGetAllModeLines=yes
ac_cv_lib_bind_gethostent=yes
ac_cv_lib_cares_ares_init=yes
ac_cv_lib_m_acosf=yes
ac_cv_lib_m_asinf=yes
ac_cv_lib_m_atan2f=yes
ac_cv_lib_m_atanf=yes
ac_cv_lib_m_cosf=yes
ac_cv_lib_m_expf=yes
ac_cv_lib_m_fabsf=yes
ac_cv_lib_m_floorf=yes
ac_cv_lib_m_fmodf=yes
ac_cv_lib_m_hypotf=yes
ac_cv_lib_m_logf=yes
ac_cv_lib_m_powf=yes
ac_cv_lib_m_sinf=yes
ac_cv_lib_m_sqrtf=yes
ac_cv_lib_m_tanf=yes
ac_cv_lib_socket_socket=no
ac_cv_lib_z_compress=yes
ac_cv_objext=o
ac_cv_path_SDL_CONFIG=/usr/local/bin/sdl-config
ac_cv_path_install='/usr/bin/install -c'
ac_cv_prog_AR=ar
ac_cv_prog_AWK=gawk
ac_cv_prog_CPP='gcc -E'
ac_cv_prog_CXXCPP='g++ -E'
ac_cv_prog_HASPOD2MAN=yes
ac_cv_prog_HASWHOAMI=yes
ac_cv_prog_ac_ct_CC=gcc
ac_cv_prog_ac_ct_CXX=g++
ac_cv_prog_ac_ct_RANLIB=ranlib
ac_cv_prog_ac_ct_WINDRES=:
ac_cv_prog_cc_g=yes
ac_cv_prog_cc_stdc=
ac_cv_prog_cxx_g=yes
ac_cv_prog_egrep='grep -E'
ac_cv_prog_make_make_set=yes
ac_cv_search_glBegin=-lGL
ac_cv_search_gluScaleImage=-lGLU
ac_cv_target=i686-pc-linux-gnu
ac_cv_target_alias=i686-pc-linux-gnu
ac_cv_type_socklen_t=yes
am_cv_CC_dependencies_compiler_type=gcc3
am_cv_CXX_dependencies_compiler_type=gcc3
mp_cv_ncurses=yes
my_cv_curl_vers=7.12.3
## ----------------- ##
## Output variables. ##
## ----------------- ##
ACLOCAL='${SHELL} /home/linux/bzflag/missing --run aclocal-1.9'
AMDEPBACKSLASH='\'
AMDEP_FALSE='#'
AMDEP_TRUE=''
AMTAR='${SHELL} /home/linux/bzflag/missing --run tar'
AR='ar'
AR_FLAGS=''
AUTOCONF='${SHELL} /home/linux/bzflag/missing --run autoconf'
AUTOHEADER='${SHELL} /home/linux/bzflag/missing --run autoheader'
AUTOMAKE='${SHELL} /home/linux/bzflag/missing --run automake-1.9'
AWK='gawk'
BEOS_FALSE=''
BEOS_TRUE='#'
BUGGY_MIPSPRO_FALSE=''
BUGGY_MIPSPRO_TRUE='#'
BUILDCARES_FALSE=''
BUILDCARES_TRUE='#'
BUILDZLIB_FALSE=''
BUILDZLIB_TRUE='#'
BUILD_REGEX_FALSE='#'
BUILD_REGEX_TRUE=''
BZADMIN_INCLUDED_FALSE='#'
BZADMIN_INCLUDED_TRUE=''
BZFLAG_VERSION='2.0.3'
CC='gcc'
CCACHE=''
CCDEPMODE='depmode=gcc3'
CFLAGS='-g -O2'
CLIENT_INCLUDED_FALSE='#'
CLIENT_INCLUDED_TRUE=''
CONFIG=''
CPP='gcc -E'
CPPFLAGS=' -Wall -W -Wshadow -mcpu=i686'
CURL_CFLAGS=''
CURL_LIBS='-L/usr/lib -lcurl -L/usr/kerberos/lib -lssl -lcrypto -lgssapi_krb5 -lkrb5 -lcom_err -lk5crypto -lresolv -ldl -lz -lgssapi_krb5 -lkrb5 -lk5crypto -lcom_err -lresolv -L/usr/lib -lidn -lssl -lcrypto -lz'
CURSES_LIB='-lncurses'
CXX='g++'
CXXCPP='g++ -E'
CXXDEPMODE='depmode=gcc3'
CXXFLAGS='-g -O2 -DBZ_BUILD_DATE=20050510 -ffast-math -fno-exceptions -fsigned-char'
CYGPATH_W='echo'
DEBUG_FALSE=''
DEBUG_TRUE='#'
DEFS='-DHAVE_CONFIG_H'
DEPDIR='.deps'
ECHO_C=''
ECHO_N='-n'
ECHO_T=''
EGREP='grep -E'
EXEEXT=''
GLIBS='-lGLU -lGL -lXi -lXxf86vm -lXext -lSM -lICE -lX11 '
HASPOD2MAN='yes'
HASPOD2MAN_FALSE='#'
HASPOD2MAN_TRUE=''
HASWHOAMI='yes'
HAVE_CURSES_FALSE='#'
HAVE_CURSES_TRUE=''
HAVE_KRB5_FALSE=''
HAVE_KRB5_TRUE='#'
HAVE_SDL_FALSE='#'
HAVE_SDL_TRUE=''
INSTALL_DATA='${INSTALL} -m 644'
INSTALL_DATA_DIR='/usr/local/share/bzflag'
INSTALL_PROGRAM='${INSTALL}'
INSTALL_SCRIPT='${INSTALL}'
INSTALL_STRIP_PROGRAM='${SHELL} $(install_sh) -c -s'
IRIX_FALSE=''
IRIX_TRUE='#'
KRB5_CFLAGS=''
KRB5_CONFIG='no'
KRB5_LIBS=''
LDFLAGS=' -L/usr/X11R6/lib'
LIBDIR='$(top_srcdir)/lib'
LIBOBJS=''
LIBS='-lbind -lm '
LINUX_FALSE='#'
LINUX_TRUE=''
LN_S='ln -s'
LTLIBOBJS=''
MACOS_FALSE=''
MACOS_TRUE='#'
MAJOR_VERSION='2'
MAKEINFO='${SHELL} /home/linux/bzflag/missing --run makeinfo'
MINOR_VERSION='0'
OBJEXT='o'
PACKAGE='bzflag'
PACKAGE_BUGREPORT=''
PACKAGE_NAME=''
PACKAGE_STRING=''
PACKAGE_TARNAME=''
PACKAGE_VERSION=''
PATH_SEPARATOR=':'
PC_FALSE='#'
PC_TRUE=''
PPC_FALSE=''
PPC_TRUE='#'
RANLIB='ranlib'
SDL_CFLAGS='-I/usr/local/include/SDL -D_REENTRANT'
SDL_CONFIG='/usr/local/bin/sdl-config'
SDL_LIBS='-L/usr/local/lib -Wl,-rpath,/usr/local/lib -lSDL -lpthread'
SET_MAKE=''
SHELL='/bin/sh'
SOLARIS_FALSE=''
SOLARIS_TRUE='#'
STRIP=''
VERSION='2.0.3.20050510'
WIN32_FALSE=''
WIN32_TRUE='#'
WINDRES=':'
WINPORT=''
X_CFLAGS=' -I/usr/X11R6/include'
X_EXTRA_LIBS=''
X_LIBS=' -L/usr/X11R6/lib'
X_PRE_LIBS=' -lSM -lICE'
ac_ct_CC='gcc'
ac_ct_CXX='g++'
ac_ct_RANLIB='ranlib'
ac_ct_STRIP=''
ac_ct_WINDRES=':'
am__fastdepCC_FALSE='#'
am__fastdepCC_TRUE=''
am__fastdepCXX_FALSE='#'
am__fastdepCXX_TRUE=''
am__include='include'
am__leading_dot='.'
am__quote=''
am__tar='${AMTAR} chof - "$$tardir"'
am__untar='${AMTAR} xf -'
bindir='${exec_prefix}/bin'
build='i686-pc-linux-gnu'
build_alias=''
build_cpu='i686'
build_os='linux-gnu'
build_vendor='pc'
datadir='${prefix}/share'
desktopdir='/usr/local/share/applications'
exec_prefix='${prefix}'
host='i686-pc-linux-gnu'
host_alias=''
host_cpu='i686'
host_os='linux-gnu'
host_vendor='pc'
includedir='${prefix}/include'
infodir='${prefix}/info'
install_sh='/home/linux/bzflag/install-sh'
libdir='${exec_prefix}/lib'
libexecdir='${exec_prefix}/libexec'
localstatedir='${prefix}/var'
mandir='${prefix}/man'
mkdir_p='mkdir -p --'
oldincludedir='/usr/include'
prefix='/usr/local'
program_transform_name='s,x,x,'
sbindir='${exec_prefix}/sbin'
sharedstatedir='${prefix}/com'
sysconfdir='${prefix}/etc'
target='i686-pc-linux-gnu'
target_alias=''
target_cpu='i686'
target_os='linux-gnu'
target_vendor='pc'
## ----------- ##
## confdefs.h. ##
## ----------- ##
#define BUILD_REGEX 1
#define BZ_BUILD_OS "linux-gnu"
#define BZ_BUILD_USER "wili"
#define HALF_RATE_AUDIO 1
#define HAVE_ACOSF 1
#define HAVE_ASINF 1
#define HAVE_ATAN2F 1
#define HAVE_ATANF 1
#define HAVE_ATEXIT 1
#define HAVE_COSF 1
#define HAVE_CSTDIO 1
#define HAVE_CSTDLIB 1
#define HAVE_CSTRING 1
#define HAVE_CURL 1
#define HAVE_EXPF 1
#define HAVE_FABSF 1
#define HAVE_FF_EFFECT_RUMBLE 1
#define HAVE_FLOORF 1
#define HAVE_FMODF 1
#define HAVE_GETRLIMIT 1
#define HAVE_GL_GLX_H 1
#define HAVE_HYPOTF 1
#define HAVE_INTTYPES_H 1
#define HAVE_LIBBIND 1
#define HAVE_LIBM 1
#define HAVE_LINUX_INPUT_H 1
#define HAVE_LOGF 1
#define HAVE_MEMORY_H 1
#define HAVE_NCURSES_H
#define HAVE_POWF 1
#define HAVE_REGEX_H 1
#define HAVE_SDL 1
#define HAVE_SDL_SDL_H 1
#define HAVE_SELECT 1
#define HAVE_SINF 1
#define HAVE_SOCKLEN_T 1
#define HAVE_SQRTF 1
#define HAVE_STDINT_H 1
#define HAVE_STDINT_H 1
#define HAVE_STDLIB_H 1
#define HAVE_STD_COUNT 1
#define HAVE_STRINGS_H 1
#define HAVE_STRING_H 1
#define HAVE_SYS_PARAM_H 1
#define HAVE_SYS_STAT_H 1
#define HAVE_SYS_TYPES_H 1
#define HAVE_TANF 1
#define HAVE_UNISTD_H 1
#define HAVE_UNISTD_H 1
#define HAVE_USLEEP 1
#define HAVE_VALUES_H 1
#define HAVE_VSNPRINTF 1
#define HAVE_X11_XLIB_H 1
#define INSTALL_DATA_DIR "/usr/local/share/bzflag"
#define NDEBUG 1
#define PACKAGE "bzflag"
#define PACKAGE_BUGREPORT ""
#define PACKAGE_NAME ""
#define PACKAGE_STRING ""
#define PACKAGE_TARNAME ""
#define PACKAGE_VERSION ""
#define ROBOT 1
#define SNAPPING 1
#define STDC_HEADERS 1
#define VERSION "2.0.3.20050510"
#define XF86VIDMODE_EXT 1
#endif
#ifdef __cplusplus
extern "C" void std::exit (int) throw (); using std::exit;
configure: exit 0