All pastes #11290 Raw Edit

splashutils-error2

public text v1 · immutable
#11290 ·published 2005-05-09 08:18 UTC
rendered paste body
CC      daemon.o
daemon.c: In function `cmd_set_tty':
daemon.c:529: error: `CONFIG_NR_TTY_DEVICES' undeclared (first use in this function)
daemon.c:529: error: (Each undeclared identifier is reported only once
daemon.c:529: error: for each function it appears in.)
make: *** [daemon.o] Error 1
 
!!! ERROR: media-gfx/splashutils-1.1.9.5 failed.
!!! Function src_compile, Line 117, Exitcode 2
!!! failed to build splashutils
!!! If you need support, post the topmost build error, NOT this status message.