All pastes #11288 Raw Edit

splashutils-error1

public text v1 · immutable
#11288 ·published 2005-05-09 07:10 UTC
rendered paste body
make[1]: Leaving directory `/var/tmp/portage/splashutils-0.9.1/work/miscsplashutils-0.1.2/fbtruetype'
  CC      splash.o
splash.c: In function `main':
splash.c:218: error: `FBIOSPLASH_SETMODE' undeclared (first use in this function)
splash.c:218: error: (Each undeclared identifier is reported only once
splash.c:218: error: for each function it appears in.)
splash.c:218: error: `FB_SPLASH_MODE_SILENT' undeclared (first use in this function)
splash.c:218: error: `FB_SPLASH_MODE_VERBOSE' undeclared (first use in this function)
splash.c:239: error: `FBIOSPLASH_GETMODE' undeclared (first use in this function)
make: *** [splash.o] Error 1

!!! ERROR: media-gfx/splashutils-0.9.1 failed.
!!! Function src_install, Line 91, Exitcode 2
!!! (no error message)
!!! If you need support, post the topmost build error, NOT this status message.