---
Configuration summary for mod_mono
* Installation prefix = /usr/local
* Apache version = 2.2
* Apache modules directory = /usr/local/apache2/modules
* apxs = /usr/local/apache2/bin/apxs
* apr-config = /usr/bin/apr-1-config
* Verbose logging (debug) = no
* mono prefix = /usr/local/lib/pkgconfig/../..
* Default MonoApplicationsConfigDir = /usr/local/apache2/conf/mod-mono-applications
---
Now type 'make' to compile mod_mono.
poupou@pollux:~/svn/mod_mono> make
Making all in src
make[1]: Entering directory `/home/poupou/svn/mod_mono/src'
if /bin/sh ../libtool --tag=CC --mode=compile gcc -DHAVE_CONFIG_H -I. -I. -I../include -g -O2 -I/usr/local/apache2/include -pthread -I/usr/include -pthread -I/usr/include -pthread -DLINUX=2 -D_REENTRANT -D_GNU_SOURCE -D_LARGEFILE64_SOURCE -Wall -DDFLT_MONO_CONFIG_DIR=\"/usr/local/apache2/conf/mod-mono-applications\" -g -O2 -I/usr/local/apache2/include -pthread -I/usr/include -pthread -MT mod_mono_la-mod_mono.lo -MD -MP -MF ".deps/mod_mono_la-mod_mono.Tpo" -c -o mod_mono_la-mod_mono.lo `test -f 'mod_mono.c' || echo './'`mod_mono.c; \
then mv -f ".deps/mod_mono_la-mod_mono.Tpo" ".deps/mod_mono_la-mod_mono.Plo"; else rm -f ".deps/mod_mono_la-mod_mono.Tpo"; exit 1; fi
gcc -DHAVE_CONFIG_H -I. -I. -I../include -g -O2 -I/usr/local/apache2/include -pthread -I/usr/include -pthread -I/usr/include -pthread -DLINUX=2 -D_REENTRANT -D_GNU_SOURCE -D_LARGEFILE64_SOURCE -Wall -DDFLT_MONO_CONFIG_DIR=\"/usr/local/apache2/conf/mod-mono-applications\" -g -O2 -I/usr/local/apache2/include -pthread -I/usr/include -pthread -MT mod_mono_la-mod_mono.lo -MD -MP -MF .deps/mod_mono_la-mod_mono.Tpo -c mod_mono.c -fPIC -DPIC -o .libs/mod_mono_la-mod_mono.o
In file included from /usr/local/apache2/include/httpd.h:43,
from mod_mono.h:50,
from mod_mono.c:32:
/usr/local/apache2/include/ap_config.h:26:23: error: apr_hooks.h: No such file or directory
/usr/local/apache2/include/ap_config.h:27:32: error: apr_optional_hooks.h: No such file or directory
In file included from mod_mono.h:50,
from mod_mono.c:32:
/usr/local/apache2/include/httpd.h:54:25: error: apr_buckets.h: No such file or directory
/usr/local/apache2/include/httpd.h:723:21: error: apr_uri.h: No such file or directory
In file included from mod_mono.h:50,
from mod_mono.c:32:
/usr/local/apache2/include/httpd.h:925: error: expected specifier-qualifier-list before 'apr_uri_t'
/usr/local/apache2/include/httpd.h:1085: error: expected specifier-qualifier-list before 'APR_RING_ENTRY'
/usr/local/apache2/include/httpd.h:1202: error: expected specifier-qualifier-list before 'apr_bucket_brigade'
/usr/local/apache2/include/httpd.h:1210: error: expected specifier-qualifier-list before 'apr_bucket_brigade'
In file included from mod_mono.h:51,
from mod_mono.c:32:
/usr/local/apache2/include/http_core.h:31:26: error: apr_optional.h: No such file or directory
In file included from /usr/local/apache2/include/http_core.h:32,
from mod_mono.h:51,
from mod_mono.c:32:
/usr/local/apache2/include/util_filter.h:137: error: expected declaration specifiers or '...' before 'apr_bucket_brigade'
/usr/local/apache2/include/util_filter.h:139: error: expected declaration specifiers or '...' before 'apr_bucket_brigade'
/usr/local/apache2/include/util_filter.h:141: error: expected declaration specifiers or '...' before 'apr_read_type_e'
/usr/local/apache2/include/util_filter.h:296: error: expected declaration specifiers or '...' before 'apr_bucket_brigade'
/usr/local/apache2/include/util_filter.h:298: error: expected declaration specifiers or '...' before 'apr_read_type_e'
/usr/local/apache2/include/util_filter.h:310: error: expected declaration specifiers or '...' before 'apr_bucket_brigade'
/usr/local/apache2/include/util_filter.h:492: error: expected declaration specifiers or '...' before 'apr_bucket_brigade'
/usr/local/apache2/include/util_filter.h:493: error: expected declaration specifiers or '...' before 'apr_bucket_brigade'
/usr/local/apache2/include/util_filter.h:503: error: expected ')' before '*' token
/usr/local/apache2/include/util_filter.h:511: error: expected declaration specifiers or '...' before 'apr_bucket_brigade'
/usr/local/apache2/include/util_filter.h:548: error: expected declaration specifiers or '...' before 'apr_bucket_brigade'
/usr/local/apache2/include/util_filter.h:559: error: expected declaration specifiers or '...' before 'apr_bucket_brigade'
/usr/local/apache2/include/util_filter.h:562: error: format string argument not a string type
In file included from mod_mono.h:51,
from mod_mono.c:32:
/usr/local/apache2/include/http_core.h:662: error: expected ')' before 'int'
/usr/local/apache2/include/http_core.h:680: error: expected declaration specifiers or '...' before 'ap_ident_lookup'
/usr/local/apache2/include/http_core.h:681: error: expected declaration specifiers or '...' before '(' token
/usr/local/apache2/include/http_core.h:681: warning: data definition has no type or storage class
/usr/local/apache2/include/http_core.h:681: warning: type defaults to 'int' in declaration of 'APR_DECLARE_OPTIONAL_FN'
In file included from mod_mono.h:52,
from mod_mono.c:32:
/usr/local/apache2/include/http_log.h:335: error: expected ')' before 'void'
In file included from /usr/local/apache2/include/http_config.h:30,
from mod_mono.h:53,
from mod_mono.c:32:
/usr/local/apache2/include/util_cfgtree.h:72: error: expected '=', ',', ';', 'asm' or '__attribute__' before '*' token
/usr/local/apache2/include/util_cfgtree.h:83: error: expected '=', ',', ';', 'asm' or '__attribute__' before '*' token
In file included from mod_mono.h:53,
from mod_mono.c:32:
/usr/local/apache2/include/http_config.h:288: error: expected specifier-qualifier-list before 'ap_directive_t'
/usr/local/apache2/include/http_config.h:672: error: expected declaration specifiers or '...' before 'ap_directive_t'
/usr/local/apache2/include/http_config.h:673: error: expected declaration specifiers or '...' before 'ap_directive_t'
/usr/local/apache2/include/http_config.h:687: error: expected declaration specifiers or '...' before 'ap_directive_t'
/usr/local/apache2/include/http_config.h:696: error: expected ')' before '*' token
/usr/local/apache2/include/http_config.h:975: error: expected ')' before 'int'
In file included from /usr/include/apr_global_mutex.h:26,
from /usr/include/apr_portable.h:34,
from /usr/local/apache2/include/http_protocol.h:31,
from mod_mono.h:134,
from mod_mono.c:32:
/usr/include/apr_proc_mutex.h:81: error: expected declaration specifiers or '...' before 'apr_lockmech_e'
In file included from /usr/include/apr_portable.h:34,
from /usr/local/apache2/include/http_protocol.h:31,
from mod_mono.h:134,
from mod_mono.c:32:
/usr/include/apr_global_mutex.h:76: error: expected declaration specifiers or '...' before 'apr_lockmech_e'
In file included from mod_mono.h:134,
from mod_mono.c:32:
/usr/local/apache2/include/http_protocol.h:45: error: expected ')' before 'void'
/usr/local/apache2/include/http_protocol.h:77: error: expected declaration specifiers or '...' before 'apr_bucket_brigade'
/usr/local/apache2/include/http_protocol.h:537: error: expected declaration specifiers or '...' before 'apr_bucket_brigade'
/usr/local/apache2/include/http_protocol.h:569: error: expected ')' before 'int'
/usr/local/apache2/include/http_protocol.h:608: error: expected specifier-qualifier-list before 'apr_bucket_refcount'
/usr/local/apache2/include/http_protocol.h:616: error: expected '=', ',', ';', 'asm' or '__attribute__' before 'ap_bucket_type_error'
/usr/local/apache2/include/http_protocol.h:633: error: expected '=', ',', ';', 'asm' or '__attribute__' before '*' token
/usr/local/apache2/include/http_protocol.h:644: error: expected '=', ',', ';', 'asm' or '__attribute__' before '*' token
/usr/local/apache2/include/http_protocol.h:648: error: expected declaration specifiers or '...' before 'apr_bucket_brigade'
/usr/local/apache2/include/http_protocol.h:649: error: expected declaration specifiers or '...' before 'apr_bucket_brigade'
/usr/local/apache2/include/http_protocol.h:651: error: expected declaration specifiers or '...' before 'apr_bucket_brigade'
/usr/local/apache2/include/http_protocol.h:652: error: expected declaration specifiers or '...' before 'apr_bucket_brigade'
In file included from mod_mono.h:135,
from mod_mono.c:32:
/usr/local/apache2/include/http_request.h:131: error: expected declaration specifiers or '...' before 'apr_bucket_brigade'
/usr/local/apache2/include/http_request.h:261: error: expected ')' before 'int'
In file included from mod_mono.h:136,
from mod_mono.c:32:
/usr/local/apache2/include/util_script.h:104: error: expected declaration specifiers or '...' before 'apr_bucket_brigade'
mod_mono.c: In function 'set_alias':
mod_mono.c:116: error: 'cmd_parms' has no member named 'server'
mod_mono.c:119: error: 'cmd_parms' has no member named 'pool'
mod_mono.c: In function 'set_auto_application':
mod_mono.c:131: error: 'cmd_parms' has no member named 'server'
mod_mono.c:134: error: 'cmd_parms' has no member named 'pool'
mod_mono.c:140: error: 'cmd_parms' has no member named 'pool'
mod_mono.c:144: error: 'cmd_parms' has no member named 'pool'
mod_mono.c: In function 'store_config_xsp':
mod_mono.c:214: error: 'cmd_parms' has no member named 'server'
mod_mono.c:227: error: 'cmd_parms' has no member named 'pool'
mod_mono.c:229: error: 'cmd_parms' has no member named 'pool'
mod_mono.c:236: error: 'cmd_parms' has no member named 'server'
mod_mono.c:237: error: 'cmd_parms' has no member named 'server'
mod_mono.c:242: error: 'cmd_parms' has no member named 'pool'
mod_mono.c:254: error: 'cmd_parms' has no member named 'pool'
mod_mono.c:254: error: 'cmd_parms' has no member named 'server'
mod_mono.c:264: error: 'cmd_parms' has no member named 'pool'
mod_mono.c:266: error: 'cmd_parms' has no member named 'pool'
mod_mono.c: In function 'connection_get_remote_name':
mod_mono.c:391: error: 'request_rec' has no member named 'per_dir_config'
mod_mono.c: In function 'get_client_block_buffer':
mod_mono.c:598: error: 'request_rec' has no member named 'request_config'
mod_mono.c:602: error: 'request_rec' has no member named 'request_config'
mod_mono.c: In function 'mono_execute_request':
mod_mono.c:1412: error: 'request_rec' has no member named 'per_dir_config'
mod_mono.c:1413: error: 'request_rec' has no member named 'per_dir_config'
mod_mono.c: In function 'mono_control_panel_handler':
mod_mono.c:1666: error: 'apr_uri_t' undeclared (first use in this function)
mod_mono.c:1666: error: (Each undeclared identifier is reported only once
mod_mono.c:1666: error: for each function it appears in.)
mod_mono.c:1666: error: 'uri' undeclared (first use in this function)
mod_mono.c:1683: error: 'request_rec' has no member named 'parsed_uri'
mod_mono.c: In function 'mono_register_hooks':
mod_mono.c:1795: warning: implicit declaration of function 'ap_hook_handler'
mod_mono.c:1795: error: 'APR_HOOK_FIRST' undeclared (first use in this function)
mod_mono.c:1797: warning: implicit declaration of function 'ap_hook_post_config'
mod_mono.c:1797: error: 'APR_HOOK_MIDDLE' undeclared (first use in this function)
mod_mono.c:1798: warning: implicit declaration of function 'ap_hook_child_init'
make[1]: *** [mod_mono_la-mod_mono.lo] Error 1
make[1]: Leaving directory `/home/poupou/svn/mod_mono/src'
make: *** [all-recursive] Error 1