>>> Emerging (1 of 222) sys-apps/baselayout-1.12.3 to /
* Previously fetched: baselayout-1.12.3.tar.bz2 MD5 ;-) ... [ ok ]
* Previously fetched: baselayout-1.12.3.tar.bz2 RMD160 ;-) ... [ ok ]
* Previously fetched: baselayout-1.12.3.tar.bz2 SHA1 ;-) ... [ ok ]
* Previously fetched: baselayout-1.12.3.tar.bz2 SHA256 ;-) ... [ ok ]
* Previously fetched: baselayout-1.12.3.tar.bz2 size ;-) ... [ ok ]
* checking ebuild checksums ;-) ... [ ok ]
* checking auxfile checksums ;-) ... [ ok ]
* checking miscfile checksums ;-) ... [ ok ]
* checking baselayout-1.12.3.tar.bz2 ;-) ... [ ok ]
>>> Unpacking source...
>>> Unpacking baselayout-1.12.3.tar.bz2 to /var/tmp/portage/baselayout-1.12.3/work
>>> Source unpacked.
>>> Compiling source in /var/tmp/portage/baselayout-1.12.3/work/baselayout-1.12.3 ...
make: Entering directory `/var/tmp/portage/baselayout-1.12.3/work/baselayout-1.12.3/src'
i686-pc-linux-gnu-gcc -O3 -mtune=athlon-xp -fomit-frame-pointer -pipe -DLIBDIR=\"lib\" consoletype.c -o consoletype
i686-pc-linux-gnu-gcc -O3 -mtune=athlon-xp -fomit-frame-pointer -pipe -DLIBDIR=\"lib\" -c -o runscript.o runscript.c
runscript.c:19:24: error: core/debug.h: No such file or directory
runscript.c:20:23: error: core/misc.h: No such file or directory
runscript.c: In function get_whitelist:
runscript.c:80: warning: incompatible implicit declaration of built-in function strndup
runscript.c:96: error: error undeclared (first use in this function)
runscript.c:96: error: (Each undeclared identifier is reported only once
runscript.c:96: error: for each function it appears in.)
runscript.c: In function filter_environ:
runscript.c:148: error: expected ; before { token
runscript.c:199: error: error undeclared (first use in this function)
make: *** [runscript.o] Error 1
make: Leaving directory `/var/tmp/portage/baselayout-1.12.3/work/baselayout-1.12.3/src'
!!! ERROR: sys-apps/baselayout-1.12.3 failed.
Call stack:
ebuild.sh, line 1543: Called dyn_compile
ebuild.sh, line 938: Called src_compile
baselayout-1.12.3.ebuild, line 68: Called die
!!! (no error message)
!!! If you need support, post the topmost build error, and the call stack if relevant.
Error in sys.exitfunc:
root@sdr ~ #