rendered paste body../../src/lib/ecore_evas/.libs/libecore_evas.so: undefined reference to `evas_key_modifier_is_set'
../../src/lib/ecore_evas/.libs/libecore_evas.so: undefined reference to `evas_key_lock_is_set'
collect2: ld returned 1 exit status
make[3]: *** [ecore_test] Error 1
make[3]: Leaving directory `/home/lgates/e17/libs/ecore/src/bin'
make[2]: *** [all-recursive] Error 1
make[2]: Leaving directory `/home/lgates/e17/libs/ecore/src'
make[1]: *** [all-recursive] Error 1
make[1]: Leaving directory `/home/lgates/e17/libs/ecore'
make: *** [all] Error 2