All pastes #109434 Raw Edit

Something

public text v1 · immutable
·published 2006-08-01 02:06 UTC
rendered paste body
Fail: filesystem component tests -> filesystem tests -> testfilesystemmanage -> failed test target: filesystem_manage at [/home/killes/checkouts/contributions/modules/filesystem/tests/filesystem.test line 30]
Fail: filesystem component tests -> filesystem tests -> testfilesystemmanage -> failed filesystem verification file not saved to managed storage area properly at [/home/killes/checkouts/contributions/modules/filesystem/tests/filesystem.test line 39]
Exception: filesystem component tests -> filesystem tests -> testfilesystemmanage -> Unexpected PHP error [copy(files/public/files/tmp/filesystem_manage_test.txt): failed to open stream: Datei oder Verzeichnis nicht gefunden] severity [E_WARNING] in [/home/killes/checkouts/contributions/modules/filesystem/drivers/php.driver] line [70]
Fail: filesystem component tests -> filesystem tests -> testfilesystemmove -> True assertion got False at [/home/killes/checkouts/contributions/modules/filesystem/tests/filesystem.test line 70]
Fail: filesystem component tests -> filesystem tests -> testfilesystemmove -> filesystem_move failed at [/home/killes/checkouts/contributions/modules/filesystem/tests/filesystem.test line 79]
Fail: filesystem component tests -> filesystem tests -> testfilesystemmove -> destination file does not exist at [/home/killes/checkouts/contributions/modules/filesystem/tests/filesystem.test line 80]
Exception: filesystem component tests -> filesystem tests -> testfilesystemmove -> Unexpected PHP error [copy(files/public/files/tmp/filesystem_move_test.txt): failed to open stream: Datei oder Verzeichnis nicht gefunden] severity [E_WARNING] in [/home/killes/checkouts/contributions/modules/filesystem/drivers/php.driver] line [70]
Fail: filesystem component tests -> filesystem tests -> testfilesystemcopy -> True assertion got False at [/home/killes/checkouts/contributions/modules/filesystem/tests/filesystem.test line 110]
Fail: filesystem component tests -> filesystem tests -> testfilesystemcopy -> filesystem_copy failed at [/home/killes/checkouts/contributions/modules/filesystem/tests/filesystem.test line 119]
Fail: filesystem component tests -> filesystem tests -> testfilesystemcopy -> destination file does not exist at [/home/killes/checkouts/contributions/modules/filesystem/tests/filesystem.test line 120]
Fail: filesystem component tests -> filesystem tests -> testfilesystemcopy -> original file was removed on filesystem_copy test. at [/home/killes/checkouts/contributions/modules/filesystem/tests/filesystem.test line 121]
Exception: filesystem component tests -> filesystem tests -> testfilesystemcopy -> Unexpected PHP error [copy(files/public/files/tmp/filesystem_copy_test.txt): failed to open stream: Datei oder Verzeichnis nicht gefunden] severity [E_WARNING] in [/home/killes/checkouts/contributions/modules/filesystem/drivers/php.driver] line [70]
Fail: filesystem component tests -> filesystem tests -> testfilesystemremove -> True assertion got False at [/home/killes/checkouts/contributions/modules/filesystem/tests/filesystem.test line 160]
Fail: filesystem component tests -> filesystem tests -> testfilesystemremove -> filesystem_remove failed at [/home/killes/checkouts/contributions/modules/filesystem/tests/filesystem.test line 163]
Exception: filesystem component tests -> filesystem tests -> testfilesystemremove -> Unexpected PHP error [copy(files/public/files/tmp/filesystem_remove_test.txt): failed to open stream: Datei oder Verzeichnis nicht gefunden] severity [E_WARNING] in [/home/killes/checkouts/contributions/modules/filesystem/drivers/php.driver] line [70]