All pastes #1092428 Raw Edit

Miscellany

public text v1 · immutable
#1092428 ·published 2008-08-04 12:32 UTC
rendered paste body
Machine: i386
Release: 4.2
System: OpenBSD
checking for a usable C compiler...checking for compiler warnings.../usr/bin/cc   -Wall -Werror -o ./conftest conftest.c 
yes
checking for IEEE754 floating point.../usr/bin/cc  -Wall -Werror  -o ./conftest conftest.c 
yes
checking __bounded__ attribute.../usr/bin/cc  -Wall -Werror  -o ./conftest conftest.c 
yes
checking __format__ attribute.../usr/bin/cc  -Wall -Werror  -o ./conftest conftest.c 
yes
checking __nonnull__ attribute.../usr/bin/cc  -Wall -Werror -Wall -Werror -o ./conftest conftest.c
yes
checking __aligned__ attribute.../usr/bin/cc  -Wall -Werror -Wall -Werror -o ./conftest conftest.c
yes
checking __packed__ attribute.../usr/bin/cc  -Wall -Werror -Wall -Werror -o ./conftest conftest.c
yes
checking for long double.../usr/bin/cc  -Wall -Werror -o ./conftest conftest.c
yes
checking for long long.../usr/bin/cc  -Wall -Werror -o ./conftest conftest.c
yes
checking for cygwin environment.../usr/bin/cc  -Wall -Werror -mcygwin -o ./conftest conftest.c
cc1: error: invalid option `cygwin'
-> failed (0)
no
checking for <sys/types.h>.../usr/bin/cc  -Wall -Werror  -o ./conftest conftest.c 
yes
checking for 64-bit types.../usr/bin/cc  -Wall -Werror  -o ./conftest conftest.c 
yes
checking for conflicting typedefs.../usr/bin/cc  -Wall -Werror  -o ./conftest conftest.c 
conftest.c: In function `main':
conftest.c:3: error: syntax error before "foo"
conftest.c:6: error: `foo' undeclared (first use in this function)
conftest.c:6: error: (Each undeclared identifier is reported only once
conftest.c:6: error: for each function it appears in.)
conftest.c:6: error: `bar' undeclared (first use in this function)
conftest.c:6: error: `baz' undeclared (first use in this function)
no
checking for Agar (http://libagar.org/)...yes
checking whether Agar works.../usr/bin/cc  -Wall -Werror -I/usr/local/include/agar -I/usr/local/include/SDL -D_REENTRANT -I/usr/X11R6/include/freetype2 -I/usr/X11R6/include -I/usr/X11R6/include  -I/usr/local/include   -o ./conftest conftest.c -L/usr/local/lib -lag_gui -lag_core -L/usr/local/lib -L/usr/X11R6/lib -lSDL -pthread -lm -L/usr/X11R6/lib -lX11 -lXext -lusbhid -L/usr/X11R6/lib -lfreetype -lz -L/usr/X11R6/lib -lGL -lm -L/usr/local/lib -ljpeg -lpthread 
/usr/local/lib/libSDL.so.7.0: warning: strcpy() is almost always misused, please use strlcpy()
/usr/local/lib/libSDL.so.7.0: warning: sprintf() is often misused, please use snprintf()
/usr/X11R6/lib/libX11.so.11.1: warning: strcat() is almost always misused, please use strlcat()
/usr/bin/ld: warning: libX11.so.10.0, needed by /usr/local/lib/libSDL.so.7.0, may conflict with libX11.so.11.1
yes
checking for agar-vg (http://hypertriton.com/agar-vg/)...yes
checking whether agar-vg works.../usr/bin/cc  -Wall -Werror -I/usr/local/include/agar  -I/usr/local/include/agar -I/usr/local/include/SDL -D_REENTRANT -I/usr/X11R6/include/freetype2 -I/usr/X11R6/include -I/usr/X11R6/include  -I/usr/local/include   -o ./conftest conftest.c -L/usr/local/lib -lag_vg -L/usr/local/lib -lag_gui -lag_core -L/usr/local/lib -L/usr/X11R6/lib -lSDL -pthread -lm -L/usr/X11R6/lib -lX11 -lXext -lusbhid -L/usr/X11R6/lib -lfreetype -lz -L/usr/X11R6/lib -lGL -lm -L/usr/local/lib -ljpeg -lpthread 
/usr/local/lib/libSDL.so.7.0: warning: strcpy() is almost always misused, please use strlcpy()
/usr/local/lib/libSDL.so.7.0: warning: sprintf() is often misused, please use snprintf()
/usr/X11R6/lib/libX11.so.11.1: warning: strcat() is almost always misused, please use strlcat()
/usr/bin/ld: warning: libX11.so.10.0, needed by /usr/local/lib/libSDL.so.7.0, may conflict with libX11.so.11.1
/usr/local/lib/libag_vg.so.1.0: undefined reference to `vgProximityTool'
collect2: ld returned 1 exit status
no
checking for agar-dev (http://hypertriton.com/agar-dev/)...yes
checking whether agar-dev works.../usr/bin/cc  -Wall -Werror -I/usr/local/include/agar  -I/usr/local/include/agar -I/usr/local/include/SDL -D_REENTRANT -I/usr/X11R6/include/freetype2 -I/usr/X11R6/include -I/usr/X11R6/include  -I/usr/local/include   -o ./conftest conftest.c -L/usr/local/lib -lag_dev -L/usr/local/lib -lag_gui -lag_core -L/usr/local/lib -L/usr/X11R6/lib -lSDL -pthread -lm -L/usr/X11R6/lib -lX11 -lXext -lusbhid -L/usr/X11R6/lib -lfreetype -lz -L/usr/X11R6/lib -lGL -lm -L/usr/local/lib -ljpeg -lpthread 
/usr/local/lib/libSDL.so.7.0: warning: strcpy() is almost always misused, please use strlcpy()
/usr/local/lib/libSDL.so.7.0: warning: sprintf() is often misused, please use snprintf()
/usr/X11R6/lib/libX11.so.11.1: warning: strcat() is almost always misused, please use strlcat()
/usr/bin/ld: warning: libX11.so.10.0, needed by /usr/local/lib/libSDL.so.7.0, may conflict with libX11.so.11.1
yes
checking for FreeSG (http://FreeSG.org/)...yes
checking whether FreeSG works.../usr/bin/cc  -Wall -Werror -I/usr/local/include/freesg   -I/usr/local/include/agar -I/usr/local/include/SDL -D_REENTRANT -I/usr/X11R6/include/freetype2 -I/usr/X11R6/include -I/usr/X11R6/include  -I/usr/local/include   -o ./conftest conftest.c -L/usr/local/lib -lfreesg_pe -lfreesg_sk -lfreesg -lfreesg_m -lm  -L/usr/local/lib -lag_gui -lag_core -L/usr/local/lib -L/usr/X11R6/lib -lSDL -pthread -lm -L/usr/X11R6/lib -lX11 -lXext -lusbhid -L/usr/X11R6/lib -lfreetype -lz -L/usr/X11R6/lib -lGL -lm -L/usr/local/lib -ljpeg -lpthread 
In file included from /usr/local/include/freesg/freesg/m/m_vector.h:213,
                 from /usr/local/include/freesg/freesg/m/m.h:32,
                 from /usr/local/include/freesg/freesg/sg/sg.h:11,
                 from /usr/local/include/freesg/freesg/sg.h:9,
                 from conftest.c:3:
/usr/local/include/freesg/freesg/m/m_vector_fpu.h: In function `M_VectorCopy_FPU':
/usr/local/include/freesg/freesg/m/m_vector_fpu.h:269: warning: unused variable `i'
no
checking for the getopt() function.../usr/bin/cc  -Wall -Werror -o ./conftest conftest.c
yes
checking for POSIX threads.../usr/bin/cc  -D_ES_INTERNAL -D_USE_AGAR_STD -D_USE_AGAR_CORE -D_USE_AGAR_QUEUE -D_USE_AGAR_GUI -D_USE_SG_MATH -I/home/darkroot/edacious -Wall -Werror  -o ./conftest conftest.c -lpthread
yes
checking for the X/Open Threads Extension.../usr/bin/cc  -D_ES_INTERNAL -D_USE_AGAR_STD -D_USE_AGAR_CORE -D_USE_AGAR_QUEUE -D_USE_AGAR_GUI -D_USE_SG_MATH -I/home/darkroot/edacious  -Wall -Werror -U_XOPEN_SOURCE -D_XOPEN_SOURCE=600 -o ./conftest conftest.c -lpthread
yes
checking for PTHREAD_MUTEX_RECURSIVE.../usr/bin/cc  -D_ES_INTERNAL -D_USE_AGAR_STD -D_USE_AGAR_CORE -D_USE_AGAR_QUEUE -D_USE_AGAR_GUI -D_USE_SG_MATH -I/home/darkroot/edacious  -Wall -Werror  -o ./conftest conftest.c -lpthread
yes
checking for PTHREAD_MUTEX_RECURSIVE_NP.../usr/bin/cc  -D_ES_INTERNAL -D_USE_AGAR_STD -D_USE_AGAR_CORE -D_USE_AGAR_QUEUE -D_USE_AGAR_GUI -D_USE_SG_MATH -I/home/darkroot/edacious  -Wall -Werror  -o ./conftest conftest.c -lpthread
conftest.c: In function `main':
conftest.c:7: error: `PTHREAD_MUTEX_RECURSIVE_NP' undeclared (first use in this function)
conftest.c:7: error: (Each undeclared identifier is reported only once
conftest.c:7: error: for each function it appears in.)
no