su-2.05b# gmake
cc -fPIC -I../asterisk -D_GNU_SOURCE -I/usr/local/include/mysql -c -o app_addon_sql_mysql.o app_addon_sql_mysql.c
app_addon_sql_mysql.c:15:27: asterisk/file.h: No such file or directory
app_addon_sql_mysql.c:16:29: asterisk/logger.h: No such file or directory
app_addon_sql_mysql.c:17:30: asterisk/channel.h: No such file or directory
app_addon_sql_mysql.c:18:26: asterisk/pbx.h: No such file or directory
app_addon_sql_mysql.c:19:29: asterisk/module.h: No such file or directory
app_addon_sql_mysql.c:20:34: asterisk/linkedlists.h: No such file or directory
app_addon_sql_mysql.c:21:31: asterisk/chanvars.h: No such file or directory
app_addon_sql_mysql.c:22:27: asterisk/lock.h: No such file or directory
app_addon_sql_mysql.c:74: warning: data definition has no type or storage class
app_addon_sql_mysql.c:75: warning: data definition has no type or storage class
app_addon_sql_mysql.c:77: warning: parameter names (without types) in function declaration
app_addon_sql_mysql.c:77: warning: data definition has no type or storage class
app_addon_sql_mysql.c:88: error: syntax error before "AST_LIST_ENTRY"
app_addon_sql_mysql.c:91: error: syntax error before "_mysql_ids_head"
app_addon_sql_mysql.c:91: warning: data definition has no type or storage class
app_addon_sql_mysql.c: In function `find_identifier':
app_addon_sql_mysql.c:100: warning: assignment from incompatible pointer type
app_addon_sql_mysql.c:103: error: `LOG_WARNING' undeclared (first use in this function)
app_addon_sql_mysql.c:103: error: (Each undeclared identifier is reported only once
app_addon_sql_mysql.c:103: error: for each function it appears in.)
app_addon_sql_mysql.c:105: error: `entries' undeclared (first use in this function)
app_addon_sql_mysql.c:105: error: syntax error before '{' token
app_addon_sql_mysql.c:109: error: break statement not within loop or switch
app_addon_sql_mysql.c: At top level:
app_addon_sql_mysql.c:112: error: syntax error before "if"
gmake: *** [app_addon_sql_mysql.o] Error 1