All pastes #1090358 Raw Edit

Unnamed

public text v1 · immutable
#1090358 ·published 2008-08-02 01:32 UTC
rendered paste body
dpatch  deapply-all  
rm -rf patch-stamp patch-stampT debian/patched
dh_testdir
#dh_testroot
# Cleaning package
/usr/bin/make clean
make[1]: Entering directory `/usr/src/modules/ipw3945'
rm -f *.{mod.c,mod,o,ko,rej,orig} .*.{stamp,flags,cmd} .lst *.lst *~ 
rm -rf /usr/src/modules/ipw3945/tmp /usr/src/modules/ipw3945/.tmp_versions
for file in *.{c,h}; do \
		sed -i -e "s:\ *$::g" -e "s:\t*$::g" $file; \
	done
make[1]: Leaving directory `/usr/src/modules/ipw3945'
dh_clean
/usr/bin/make  -f debian/rules clean
make[1]: Entering directory `/usr/src/modules/ipw3945'
dpatch  deapply-all  
rm -rf patch-stamp patch-stampT debian/patched
dh_testdir
#dh_testroot
# Cleaning package
/usr/bin/make clean
make[2]: Entering directory `/usr/src/modules/ipw3945'
rm -f *.{mod.c,mod,o,ko,rej,orig} .*.{stamp,flags,cmd} .lst *.lst *~ 
rm -rf /usr/src/modules/ipw3945/tmp /usr/src/modules/ipw3945/.tmp_versions
for file in *.{c,h}; do \
		sed -i -e "s:\ *$::g" -e "s:\t*$::g" $file; \
	done
make[2]: Leaving directory `/usr/src/modules/ipw3945'
dh_clean
make[1]: Leaving directory `/usr/src/modules/ipw3945'
/usr/bin/make  -f debian/rules kdist_clean kdist_config binary-modules
make[1]: Entering directory `/usr/src/modules/ipw3945'
dpatch  deapply-all  
rm -rf patch-stamp patch-stampT debian/patched
dh_testdir
#dh_testroot
# Cleaning package
/usr/bin/make clean
make[2]: Entering directory `/usr/src/modules/ipw3945'
rm -f *.{mod.c,mod,o,ko,rej,orig} .*.{stamp,flags,cmd} .lst *.lst *~ 
rm -rf /usr/src/modules/ipw3945/tmp /usr/src/modules/ipw3945/.tmp_versions
for file in *.{c,h}; do \
		sed -i -e "s:\ *$::g" -e "s:\t*$::g" $file; \
	done
make[2]: Leaving directory `/usr/src/modules/ipw3945'
dh_clean
/usr/bin/make -w -f debian/rules clean
make[2]: Entering directory `/usr/src/modules/ipw3945'
dpatch  deapply-all  
rm -rf patch-stamp patch-stampT debian/patched
dh_testdir
#dh_testroot
# Cleaning package
/usr/bin/make clean
make[3]: Entering directory `/usr/src/modules/ipw3945'
rm -f *.{mod.c,mod,o,ko,rej,orig} .*.{stamp,flags,cmd} .lst *.lst *~ 
rm -rf /usr/src/modules/ipw3945/tmp /usr/src/modules/ipw3945/.tmp_versions
for file in *.{c,h}; do \
		sed -i -e "s:\ *$::g" -e "s:\t*$::g" $file; \
	done
make[3]: Leaving directory `/usr/src/modules/ipw3945'
dh_clean
make[2]: Leaving directory `/usr/src/modules/ipw3945'
make[1]: Nothing to be done for `kdist_config'.
for templ in ; do \
    cp $templ `echo $templ | sed -e 's/_KVERS_/2.6.24-etchnhalf.1-686/g'` ; \
  done
for templ in `ls debian/*.modules.in` ; do \
    test -e ${templ%.modules.in}.backup || cp ${templ%.modules.in} ${templ%.modules.in}.backup 2>/dev/null || true; \
    sed -e 's/##KVERS##/2.6.24-etchnhalf.1-686/g ;s/#KVERS#/2.6.24-etchnhalf.1-686/g ; s/_KVERS_/2.6.24-etchnhalf.1-686/g ; s/##KDREV##/2.6.24-6~etchnhalf.4/g ; s/#KDREV#/2.6.24-6~etchnhalf.4/g ; s/_KDREV_/2.6.24-6~etchnhalf.4/g  ' < $templ > ${templ%.modules.in}; \
  done
dh_testroot
dh_clean -k
# Build the module
/usr/bin/make modules KSRC=/lib/modules/2.6.24-etchnhalf.1-686/build KVER=2.6.24-etchnhalf.1-686
make[2]: Entering directory `/usr/src/modules/ipw3945'
/usr/bin/make -C /lib/modules/2.6.24-etchnhalf.1-686/build M=/usr/src/modules/ipw3945  modules
make[3]: Entering directory `/usr/src/linux-headers-2.6.24-etchnhalf.1-686'
  CC [M]  /usr/src/modules/ipw3945/ipw3945.o
/usr/src/modules/ipw3945/ipw3945.c: In function ipw_setup_activity_timer:
/usr/src/modules/ipw3945/ipw3945.c:1351: warning: passing argument 2 of queue_delayed_work from incompatible pointer type
/usr/src/modules/ipw3945/ipw3945.c: In function ipw_bg_activity_timer:
/usr/src/modules/ipw3945/ipw3945.c:1371: warning: passing argument 2 of queue_delayed_work from incompatible pointer type
/usr/src/modules/ipw3945/ipw3945.c: In function ipw_scan_schedule:
/usr/src/modules/ipw3945/ipw3945.c:2436: warning: passing argument 2 of queue_delayed_work from incompatible pointer type
/usr/src/modules/ipw3945/ipw3945.c: In function ipw_scan_cancel:
/usr/src/modules/ipw3945/ipw3945.c:2502: warning: passing argument 1 of cancel_delayed_work from incompatible pointer type
/usr/src/modules/ipw3945/ipw3945.c: In function ipw_scan_completed:
/usr/src/modules/ipw3945/ipw3945.c:2533: warning: passing argument 1 of cancel_delayed_work from incompatible pointer type
/usr/src/modules/ipw3945/ipw3945.c: In function ipw_print_rx_config_cmd:
/usr/src/modules/ipw3945/ipw3945.c:2691: error: implicit declaration of function MAC_ARG
/usr/src/modules/ipw3945/ipw3945.c:2691: warning: too few arguments for format
/usr/src/modules/ipw3945/ipw3945.c:2693: warning: too few arguments for format
/usr/src/modules/ipw3945/ipw3945.c: In function ipw_send_associate:
/usr/src/modules/ipw3945/ipw3945.c:4401: warning: too few arguments for format
/usr/src/modules/ipw3945/ipw3945.c: In function ipw_bg_calibrated_work:
/usr/src/modules/ipw3945/ipw3945.c:4570: warning: passing argument 2 of queue_delayed_work from incompatible pointer type
/usr/src/modules/ipw3945/ipw3945.c:4582: warning: passing argument 2 of queue_delayed_work from incompatible pointer type
/usr/src/modules/ipw3945/ipw3945.c: In function ipw_add_station:
/usr/src/modules/ipw3945/ipw3945.c:6625: warning: too few arguments for format
/usr/src/modules/ipw3945/ipw3945.c: In function ipw_find_station:
/usr/src/modules/ipw3945/ipw3945.c:6667: warning: too few arguments for format
/usr/src/modules/ipw3945/ipw3945.c: In function ipw_send_disassociate:
/usr/src/modules/ipw3945/ipw3945.c:6709: warning: too few arguments for format
/usr/src/modules/ipw3945/ipw3945.c: In function ipw_disassociate:
/usr/src/modules/ipw3945/ipw3945.c:6756: warning: passing argument 1 of cancel_delayed_work from incompatible pointer type
/usr/src/modules/ipw3945/ipw3945.c: In function ipw_gather_stats:
/usr/src/modules/ipw3945/ipw3945.c:7140: warning: passing argument 2 of queue_delayed_work from incompatible pointer type
/usr/src/modules/ipw3945/ipw3945.c: In function ipw_find_adhoc_network:
/usr/src/modules/ipw3945/ipw3945.c:7456: warning: too few arguments for format
/usr/src/modules/ipw3945/ipw3945.c:7468: warning: too few arguments for format
/usr/src/modules/ipw3945/ipw3945.c:7482: warning: too few arguments for format
/usr/src/modules/ipw3945/ipw3945.c:7503: warning: format %02x expects type unsigned int, but argument 6 has type const char *
/usr/src/modules/ipw3945/ipw3945.c:7503: warning: too few arguments for format
/usr/src/modules/ipw3945/ipw3945.c:7534: warning: too few arguments for format
/usr/src/modules/ipw3945/ipw3945.c:7549: warning: too few arguments for format
/usr/src/modules/ipw3945/ipw3945.c:7561: warning: format %02x expects type unsigned int, but argument 6 has type char * const
/usr/src/modules/ipw3945/ipw3945.c:7561: warning: format %02x expects type unsigned int, but argument 7 has type char * const
/usr/src/modules/ipw3945/ipw3945.c:7561: warning: too few arguments for format
/usr/src/modules/ipw3945/ipw3945.c:7576: warning: too few arguments for format
/usr/src/modules/ipw3945/ipw3945.c:7587: warning: too few arguments for format
/usr/src/modules/ipw3945/ipw3945.c:7611: warning: too few arguments for format
/usr/src/modules/ipw3945/ipw3945.c:7626: warning: too few arguments for format
/usr/src/modules/ipw3945/ipw3945.c: In function ipw_best_network:
/usr/src/modules/ipw3945/ipw3945.c:7688: warning: too few arguments for format
/usr/src/modules/ipw3945/ipw3945.c:7698: warning: too few arguments for format
/usr/src/modules/ipw3945/ipw3945.c:7709: warning: too few arguments for format
/usr/src/modules/ipw3945/ipw3945.c:7719: warning: too few arguments for format
/usr/src/modules/ipw3945/ipw3945.c:7729: warning: too few arguments for format
/usr/src/modules/ipw3945/ipw3945.c:7741: warning: too few arguments for format
/usr/src/modules/ipw3945/ipw3945.c:7755: warning: too few arguments for format
/usr/src/modules/ipw3945/ipw3945.c:7776: warning: format %02x expects type unsigned int, but argument 6 has type const char *
/usr/src/modules/ipw3945/ipw3945.c:7776: warning: too few arguments for format
/usr/src/modules/ipw3945/ipw3945.c:7794: warning: format %02x expects type unsigned int, but argument 6 has type const char *
/usr/src/modules/ipw3945/ipw3945.c:7794: warning: too few arguments for format
/usr/src/modules/ipw3945/ipw3945.c:7809: warning: format %02x expects type unsigned int, but argument 6 has type long unsigned int
/usr/src/modules/ipw3945/ipw3945.c:7809: warning: too few arguments for format
/usr/src/modules/ipw3945/ipw3945.c:7822: warning: too few arguments for format
/usr/src/modules/ipw3945/ipw3945.c:7837: warning: too few arguments for format
/usr/src/modules/ipw3945/ipw3945.c:7849: warning: format %02x expects type unsigned int, but argument 6 has type char * const
/usr/src/modules/ipw3945/ipw3945.c:7849: warning: format %02x expects type unsigned int, but argument 7 has type char * const
/usr/src/modules/ipw3945/ipw3945.c:7849: warning: too few arguments for format
/usr/src/modules/ipw3945/ipw3945.c:7865: warning: too few arguments for format
/usr/src/modules/ipw3945/ipw3945.c:7876: warning: too few arguments for format
/usr/src/modules/ipw3945/ipw3945.c:7900: warning: too few arguments for format
/usr/src/modules/ipw3945/ipw3945.c:7915: warning: too few arguments for format
/usr/src/modules/ipw3945/ipw3945.c: In function ipw_debug_config:
/usr/src/modules/ipw3945/ipw3945.c:8061: warning: too few arguments for format
/usr/src/modules/ipw3945/ipw3945.c: In function ipw_bg_request_scan:
/usr/src/modules/ipw3945/ipw3945.c:8392: warning: passing argument 2 of queue_delayed_work from incompatible pointer type
/usr/src/modules/ipw3945/ipw3945.c: In function ipw_handle_assoc_response:
/usr/src/modules/ipw3945/ipw3945.c:9788: warning: format %02x expects type unsigned int, but argument 6 has type const char *
/usr/src/modules/ipw3945/ipw3945.c:9788: warning: too few arguments for format
/usr/src/modules/ipw3945/ipw3945.c:9811: warning: too few arguments for format
/usr/src/modules/ipw3945/ipw3945.c:9816: warning: passing argument 1 of cancel_delayed_work from incompatible pointer type
/usr/src/modules/ipw3945/ipw3945.c: In function ipw_associate_network:
/usr/src/modules/ipw3945/ipw3945.c:9995: warning: too few arguments for format
/usr/src/modules/ipw3945/ipw3945.c:10000: warning: passing argument 2 of queue_delayed_work from incompatible pointer type
/usr/src/modules/ipw3945/ipw3945.c: In function ipw_handle_reply_rx:
/usr/src/modules/ipw3945/ipw3945.c:11196: warning: too few arguments for format
/usr/src/modules/ipw3945/ipw3945.c:11203: warning: too few arguments for format
/usr/src/modules/ipw3945/ipw3945.c: In function ipw_rx_handle:
/usr/src/modules/ipw3945/ipw3945.c:11381: warning: passing argument 2 of queue_delayed_work from incompatible pointer type
/usr/src/modules/ipw3945/ipw3945.c: In function ipw_wx_set_mode:
/usr/src/modules/ipw3945/ipw3945.c:11824: warning: passing argument 1 of cancel_delayed_work from incompatible pointer type
/usr/src/modules/ipw3945/ipw3945.c:11825: warning: passing argument 1 of cancel_delayed_work from incompatible pointer type
/usr/src/modules/ipw3945/ipw3945.c: In function ipw_wx_set_wap:
/usr/src/modules/ipw3945/ipw3945.c:12053: warning: too few arguments for format
/usr/src/modules/ipw3945/ipw3945.c: In function ipw_wx_get_wap:
/usr/src/modules/ipw3945/ipw3945.c:12082: warning: too few arguments for format
/usr/src/modules/ipw3945/ipw3945.c: In function ipw_bg_rate_scale_flush:
/usr/src/modules/ipw3945/ipw3945.c:13983: warning: passing argument 1 of cancel_delayed_work from incompatible pointer type
/usr/src/modules/ipw3945/ipw3945.c:14010: warning: passing argument 2 of queue_delayed_work from incompatible pointer type
/usr/src/modules/ipw3945/ipw3945.c: In function ipw_rate_scale_tx_resp_handle:
/usr/src/modules/ipw3945/ipw3945.c:14267: warning: passing argument 1 of cancel_delayed_work from incompatible pointer type
/usr/src/modules/ipw3945/ipw3945.c: In function ipw_tx_skb:
/usr/src/modules/ipw3945/ipw3945.c:14907: warning: too few arguments for format
/usr/src/modules/ipw3945/ipw3945.c: In function ipw_net_set_mac_address:
/usr/src/modules/ipw3945/ipw3945.c:15104: warning: too few arguments for format
/usr/src/modules/ipw3945/ipw3945.c: In function ipw_link_down:
/usr/src/modules/ipw3945/ipw3945.c:15320: warning: passing argument 1 of cancel_delayed_work from incompatible pointer type
/usr/src/modules/ipw3945/ipw3945.c:15321: warning: passing argument 1 of cancel_delayed_work from incompatible pointer type
/usr/src/modules/ipw3945/ipw3945.c:15431:52: error: macro "INIT_WORK" passed 3 arguments, but takes just 2
/usr/src/modules/ipw3945/ipw3945.c: In function ipw_setup_deferred_work:
/usr/src/modules/ipw3945/ipw3945.c:15431: error: INIT_WORK undeclared (first use in this function)
/usr/src/modules/ipw3945/ipw3945.c:15431: error: (Each undeclared identifier is reported only once
/usr/src/modules/ipw3945/ipw3945.c:15431: error: for each function it appears in.)
/usr/src/modules/ipw3945/ipw3945.c:15432:64: error: macro "INIT_WORK" passed 3 arguments, but takes just 2
/usr/src/modules/ipw3945/ipw3945.c:15433:58: error: macro "INIT_WORK" passed 3 arguments, but takes just 2
/usr/src/modules/ipw3945/ipw3945.c:15434:64: error: macro "INIT_WORK" passed 3 arguments, but takes just 2
/usr/src/modules/ipw3945/ipw3945.c:15435:48: error: macro "INIT_WORK" passed 3 arguments, but takes just 2
/usr/src/modules/ipw3945/ipw3945.c:15436:38: error: macro "INIT_WORK" passed 3 arguments, but takes just 2
/usr/src/modules/ipw3945/ipw3945.c:15437:42: error: macro "INIT_WORK" passed 3 arguments, but takes just 2
/usr/src/modules/ipw3945/ipw3945.c:15438:58: error: macro "INIT_WORK" passed 3 arguments, but takes just 2
/usr/src/modules/ipw3945/ipw3945.c:15439:58: error: macro "INIT_WORK" passed 3 arguments, but takes just 2
/usr/src/modules/ipw3945/ipw3945.c:15440:54: error: macro "INIT_WORK" passed 3 arguments, but takes just 2
/usr/src/modules/ipw3945/ipw3945.c:15441:42: error: macro "INIT_WORK" passed 3 arguments, but takes just 2
/usr/src/modules/ipw3945/ipw3945.c:15442:54: error: macro "INIT_WORK" passed 3 arguments, but takes just 2
/usr/src/modules/ipw3945/ipw3945.c:15443:48: error: macro "INIT_WORK" passed 3 arguments, but takes just 2
/usr/src/modules/ipw3945/ipw3945.c:15444:64: error: macro "INIT_WORK" passed 3 arguments, but takes just 2
/usr/src/modules/ipw3945/ipw3945.c:15445:52: error: macro "INIT_WORK" passed 3 arguments, but takes just 2
/usr/src/modules/ipw3945/ipw3945.c:15446:49: error: macro "INIT_WORK" passed 3 arguments, but takes just 2
/usr/src/modules/ipw3945/ipw3945.c:15447:64: error: macro "INIT_WORK" passed 3 arguments, but takes just 2
/usr/src/modules/ipw3945/ipw3945.c:15448:65: error: macro "INIT_WORK" passed 3 arguments, but takes just 2
/usr/src/modules/ipw3945/ipw3945.c:15450:56: error: macro "INIT_WORK" passed 3 arguments, but takes just 2
/usr/src/modules/ipw3945/ipw3945.c:15451:56: error: macro "INIT_WORK" passed 3 arguments, but takes just 2
/usr/src/modules/ipw3945/ipw3945.c:15459:56: error: macro "INIT_WORK" passed 3 arguments, but takes just 2
/usr/src/modules/ipw3945/ipw3945.c:15461:62: error: macro "INIT_WORK" passed 3 arguments, but takes just 2
/usr/src/modules/ipw3945/ipw3945.c:15463:62: error: macro "INIT_WORK" passed 3 arguments, but takes just 2
/usr/src/modules/ipw3945/ipw3945.c:15465:59: error: macro "INIT_WORK" passed 3 arguments, but takes just 2
/usr/src/modules/ipw3945/ipw3945.c:15467:39: error: macro "INIT_WORK" passed 3 arguments, but takes just 2
/usr/src/modules/ipw3945/ipw3945.c:15469:66: error: macro "INIT_WORK" passed 3 arguments, but takes just 2
/usr/src/modules/ipw3945/ipw3945.c: In function ipw_up:
/usr/src/modules/ipw3945/ipw3945.c:15903: warning: too few arguments for format
/usr/src/modules/ipw3945/ipw3945.c: In function ipw_down:
/usr/src/modules/ipw3945/ipw3945.c:15961: warning: passing argument 1 of cancel_delayed_work from incompatible pointer type
/usr/src/modules/ipw3945/ipw3945.c:15962: warning: passing argument 1 of cancel_delayed_work from incompatible pointer type
/usr/src/modules/ipw3945/ipw3945.c:15963: warning: passing argument 1 of cancel_delayed_work from incompatible pointer type
/usr/src/modules/ipw3945/ipw3945.c:15964: warning: passing argument 1 of cancel_delayed_work from incompatible pointer type
/usr/src/modules/ipw3945/ipw3945.c:15965: warning: passing argument 1 of cancel_delayed_work from incompatible pointer type
/usr/src/modules/ipw3945/ipw3945.c:15966: warning: passing argument 1 of cancel_delayed_work from incompatible pointer type
/usr/src/modules/ipw3945/ipw3945.c:15967: warning: passing argument 1 of cancel_delayed_work from incompatible pointer type
/usr/src/modules/ipw3945/ipw3945.c:15968: warning: passing argument 1 of cancel_delayed_work from incompatible pointer type
/usr/src/modules/ipw3945/ipw3945.c:15969: warning: passing argument 1 of cancel_delayed_work from incompatible pointer type
/usr/src/modules/ipw3945/ipw3945.c:15970: warning: passing argument 1 of cancel_delayed_work from incompatible pointer type
/usr/src/modules/ipw3945/ipw3945.c:15971: warning: passing argument 1 of cancel_delayed_work from incompatible pointer type
/usr/src/modules/ipw3945/ipw3945.c:15972: warning: passing argument 1 of cancel_delayed_work from incompatible pointer type
/usr/src/modules/ipw3945/ipw3945.c: In function ipw_pci_probe:
/usr/src/modules/ipw3945/ipw3945.c:16406: error: SA_SHIRQ undeclared (first use in this function)
/usr/src/modules/ipw3945/ipw3945.c:16406: warning: passing argument 2 of request_irq from incompatible pointer type
/usr/src/modules/ipw3945/ipw3945.c:16412: error: implicit declaration of function SET_MODULE_OWNER
/usr/src/modules/ipw3945/ipw3945.c:16496: warning: passing argument 1 of cancel_delayed_work from incompatible pointer type
/usr/src/modules/ipw3945/ipw3945.c: In function ipw_pci_resume:
/usr/src/modules/ipw3945/ipw3945.c:16692: warning: passing argument 2 of queue_delayed_work from incompatible pointer type
/usr/src/modules/ipw3945/ipw3945.c:16673: warning: ignoring return value of pci_enable_device, declared with attribute warn_unused_result
/usr/src/modules/ipw3945/ipw3945.c: In function ipw_init:
/usr/src/modules/ipw3945/ipw3945.c:16714: error: implicit declaration of function pci_module_init
make[4]: *** [/usr/src/modules/ipw3945/ipw3945.o] Error 1
make[3]: *** [_module_/usr/src/modules/ipw3945] Error 2
make[3]: Leaving directory `/usr/src/linux-headers-2.6.24-etchnhalf.1-686'
make[2]: *** [modules] Error 2
make[2]: Leaving directory `/usr/src/modules/ipw3945'
make[1]: *** [binary-modules] Error 2
make[1]: Leaving directory `/usr/src/modules/ipw3945'
make: *** [kdist_build] Error 2