>>> Source unpacked.
>>> Compiling source in /var/tmp/portage/dev-util/inspektor-9999/work/inspektor-9999 ...
-- The C compiler identification is GNU
-- The CXX compiler identification is GNU
-- Check for working C compiler: /usr/lib/ccache/bin/x86_64-pc-linux-gnu-gcc
-- Check for working C compiler: /usr/lib/ccache/bin/x86_64-pc-linux-gnu-gcc -- works
-- Detecting C compiler ABI info
-- Detecting C compiler ABI info - done
-- Check for working CXX compiler: /usr/lib/ccache/bin/x86_64-pc-linux-gnu-g++
-- Check for working CXX compiler: /usr/lib/ccache/bin/x86_64-pc-linux-gnu-g++ -- works
-- Detecting CXX compiler ABI info
-- Detecting CXX compiler ABI info - done
-- Looking for Q_WS_X11
-- Looking for Q_WS_X11 - found
-- Looking for Q_WS_WIN
-- Looking for Q_WS_WIN - not found.
-- Looking for Q_WS_QWS
-- Looking for Q_WS_QWS - not found.
-- Looking for Q_WS_MAC
-- Looking for Q_WS_MAC - not found.
-- Found Qt-Version 4.4.0 (using /usr/bin/qmake)
-- Looking for XOpenDisplay in /usr/lib64/libX11.so;/usr/lib64/libXext.so;/usr/lib64/libXft.so;/usr/lib64/libXau.so;/usr/lib64/libXdmcp.so;/usr/lib64/libXpm.so
-- Looking for XOpenDisplay in /usr/lib64/libX11.so;/usr/lib64/libXext.so;/usr/lib64/libXft.so;/usr/lib64/libXau.so;/usr/lib64/libXdmcp.so;/usr/lib64/libXpm.so - found
-- Looking for gethostbyname
-- Looking for gethostbyname - found
-- Looking for connect
-- Looking for connect - found
-- Looking for remove
-- Looking for remove - found
-- Looking for shmat
-- Looking for shmat - found
-- Looking for IceConnectionNumber in ICE
-- Looking for IceConnectionNumber in ICE - found
-- Found X11: /usr/lib64/libX11.so
-- Looking for include files CMAKE_HAVE_PTHREAD_H
-- Looking for include files CMAKE_HAVE_PTHREAD_H - found
-- Looking for pthread_create in pthreads
-- Looking for pthread_create in pthreads - not found
-- Looking for pthread_create in pthread
-- Looking for pthread_create in pthread - found
-- Found Automoc4: /usr/bin/automoc4
-- Found Perl: /usr/bin/perl
-- Performing Test _OFFT_IS_64BIT
-- Performing Test _OFFT_IS_64BIT - Success
-- Performing Test HAVE_FPIE_SUPPORT
-- Performing Test HAVE_FPIE_SUPPORT - Success
-- Performing Test __KDE_HAVE_W_OVERLOADED_VIRTUAL
-- Performing Test __KDE_HAVE_W_OVERLOADED_VIRTUAL - Success
-- Performing Test __KDE_HAVE_GCC_VISIBILITY
-- Performing Test __KDE_HAVE_GCC_VISIBILITY - Success
-- Found Phonon: /usr/lib64/libphonon.so
-- Found Phonon Includes: /usr/include/KDE;/usr/include
-- Found KDE 4.2 include dir: /usr/kde/svn/include
-- Found KDE 4.2 library dir: /usr/kde/svn/lib64
-- Found KDE4 kconfig_compiler preprocessor: /usr/kde/svn/bin/kconfig_compiler
-- Found automoc4: /usr/bin/automoc4
-- Could not find Alpm includes.
-- Could not find Alpm library.
-- Configuring done
-- Generating done
-- Build files have been written to: /var/tmp/portage/dev-util/inspektor-9999/work/inspektor_build
[ 1%] Generating ui_attachdialog.h
Generating systemcallmodel.moc
Generating pamview.moc
Generating PluginLoader.moc
Generating moc_PackagesViewConfig.cpp
Generating stracerunner.moc
[ 2%] Generating ui_centralwidget.h
Generating mainwindow.moc
Generating moc_StatusBarInterface.cpp
Generating centralwidget.moc
Generating moc_CoreInterface.cpp
Generating moc_BackendPlugin.cpp
Generating parser.moc
Generating moc_GuiInterface.cpp
Generating moc_Package.cpp
Generating moc_Shaman.cpp
Generating moc_TransactionInterface.cpp
Generating moc_BackendPluginInterface.cpp
Generating moc_GuiPlugin.cpp
Scanning dependencies of target secpolicy
Scanning dependencies of target kcm_shaman_packagesviewplugin
Generating moc_Settings.cpp
Generating moc_Repository.cpp
Generating moc_PackageGroup.cpp
Scanning dependencies of target inspektor
Scanning dependencies of target shamancore
[ 4%] [ 4%] Building CXX object shaman/plugins/packagesview/CMakeFiles/kcm_shaman_packagesviewplugin.dir/kcm_shaman_packagesviewplugin_automoc.o
Building CXX object shaman/plugins/packagesview/CMakeFiles/kcm_shaman_packagesviewplugin.dir/PackagesViewConfig.o
[ 5%] [ 6%] [ 7%] Building CXX object secpolicy/CMakeFiles/secpolicy.dir/main.o
Building CXX object inspektor/src/CMakeFiles/inspektor.dir/main.o
Building CXX object inspektor/src/CMakeFiles/inspektor.dir/parser.o
Linking CXX shared module ../../../lib/kcm_shaman_packagesviewplugin.so
[ 8%] [ 9%] Building CXX object secpolicy/CMakeFiles/secpolicy.dir/secpolicywin.o
Building CXX object inspektor/src/CMakeFiles/inspektor.dir/decoderfactory.o
[ 10%] Building CXX object inspektor/src/CMakeFiles/inspektor.dir/addressdecoder.o
[ 11%] [ 12%] Building CXX object secpolicy/CMakeFiles/secpolicy.dir/pamview.o
Building CXX object shaman/libshaman/CMakeFiles/shamancore.dir/Package.o
[ 13%] Building CXX object secpolicy/CMakeFiles/secpolicy.dir/ppitem.o
[ 13%] Built target kcm_shaman_packagesviewplugin
[ 14%] Building CXX object shaman/libshaman/CMakeFiles/shamancore.dir/AbstractPlugin.o
[ 15%] Building CXX object inspektor/src/CMakeFiles/inspektor.dir/painterfactory.o
[ 17%] Building CXX object secpolicy/CMakeFiles/secpolicy.dir/secpolicy_automoc.o
[ 18%] Building CXX object inspektor/src/CMakeFiles/inspektor.dir/filetracker.o
[ 19%] Building CXX object shaman/libshaman/CMakeFiles/shamancore.dir/BackendPlugin.o
Linking CXX executable secpolicy
[ 20%] Building CXX object shaman/libshaman/CMakeFiles/shamancore.dir/GuiPlugin.o
[ 21%] Building CXX object shaman/libshaman/CMakeFiles/shamancore.dir/GuiInterface.o
[ 22%] Building CXX object inspektor/src/CMakeFiles/inspektor.dir/stracerunner.o
[ 23%] Building CXX object inspektor/src/CMakeFiles/inspektor.dir/syscallinfo.o
[ 24%] Building CXX object shaman/libshaman/CMakeFiles/shamancore.dir/StatusBarInterface.o
[ 25%] Building CXX object shaman/libshaman/CMakeFiles/shamancore.dir/CoreInterface.o
[ 26%] [ 27%] Building CXX object inspektor/src/CMakeFiles/inspektor.dir/mainwindow.o
[ 28%] Building CXX object inspektor/src/CMakeFiles/inspektor.dir/systemcallmodel.o
[ 29%] Building CXX object shaman/libshaman/CMakeFiles/shamancore.dir/Repository.o
Building CXX object shaman/libshaman/CMakeFiles/shamancore.dir/Shaman.o
[ 29%] Built target secpolicy
[ 30%] Building CXX object inspektor/src/CMakeFiles/inspektor.dir/customitemdelegate.o
[ 31%] Building CXX object shaman/libshaman/CMakeFiles/shamancore.dir/PackageGroup.o
[ 32%] Building CXX object inspektor/src/CMakeFiles/inspektor.dir/centralwidget.o
[ 34%] [ 35%] [ 36%] Building CXX object shaman/libshaman/CMakeFiles/shamancore.dir/PluginLoader.o
Building CXX object shaman/libshaman/CMakeFiles/shamancore.dir/Settings.o
[ 37%] Building CXX object inspektor/src/CMakeFiles/inspektor.dir/syscalltable.o
Building CXX object shaman/libshaman/CMakeFiles/shamancore.dir/TransactionInterface.o
[ 38%] Building CXX object shaman/libshaman/CMakeFiles/shamancore.dir/BackendPluginInterface.o
[ 39%] Building CXX object inspektor/src/CMakeFiles/inspektor.dir/parameterlocator.o
[ 40%] Building CXX object inspektor/src/CMakeFiles/inspektor.dir/decoder/open.o
[ 41%] Building CXX object shaman/libshaman/CMakeFiles/shamancore.dir/shamancore_automoc.o
[ 42%] Building CXX object inspektor/src/CMakeFiles/inspektor.dir/decoder/generic.o
In file included from /var/tmp/portage/dev-util/inspektor-9999/work/inspektor-9999/inspektor/src/centralwidget.cpp:19:
/var/tmp/portage/dev-util/inspektor-9999/work/inspektor_build/inspektor/src/ui_attachdialog.h:23:44: error: ksysguard/ksysguardprocesslist.h: No such file or directory
[ 43%] Building CXX object inspektor/src/CMakeFiles/inspektor.dir/decoder/base.o
/var/tmp/portage/dev-util/inspektor-9999/work/inspektor-9999/inspektor/src/centralwidget.cpp:29:36: error: ksysguard/ProcessModel.h: No such file or directory
/var/tmp/portage/dev-util/inspektor-9999/work/inspektor-9999/inspektor/src/centralwidget.cpp:30:31: error: ksysguard/process.h: No such file or directory
[ 44%] Building CXX object inspektor/src/CMakeFiles/inspektor.dir/decoder/socket.o
Linking CXX shared library ../../lib/libshamancore.so
/var/tmp/portage/dev-util/inspektor-9999/work/inspektor_build/inspektor/src/ui_attachdialog.h:31: error: ISO C++ forbids declaration of 'KSysGuardProcessList' with no type
/var/tmp/portage/dev-util/inspektor-9999/work/inspektor_build/inspektor/src/ui_attachdialog.h:31: error: expected ';' before '*' token
/var/tmp/portage/dev-util/inspektor-9999/work/inspektor_build/inspektor/src/ui_attachdialog.h: In member function 'void Ui_AttachDialog::setupUi(QDialog*)':
/var/tmp/portage/dev-util/inspektor-9999/work/inspektor_build/inspektor/src/ui_attachdialog.h:41: error: 'ksysguardprocesslist' was not declared in this scope
/var/tmp/portage/dev-util/inspektor-9999/work/inspektor_build/inspektor/src/ui_attachdialog.h:41: error: expected type-specifier before 'KSysGuardProcessList'
/var/tmp/portage/dev-util/inspektor-9999/work/inspektor_build/inspektor/src/ui_attachdialog.h:41: error: expected `;' before 'KSysGuardProcessList'
/var/tmp/portage/dev-util/inspektor-9999/work/inspektor-9999/inspektor/src/centralwidget.cpp: In member function 'void CentralWidget::attachButtonClicked()':
/var/tmp/portage/dev-util/inspektor-9999/work/inspektor-9999/inspektor/src/centralwidget.cpp:134: error: 'class Ui::AttachDialog' has no member named 'ksysguardprocesslist'
/var/tmp/portage/dev-util/inspektor-9999/work/inspektor-9999/inspektor/src/centralwidget.cpp:135: error: 'class Ui::AttachDialog' has no member named 'ksysguardprocesslist'
/var/tmp/portage/dev-util/inspektor-9999/work/inspektor-9999/inspektor/src/centralwidget.cpp:137: error: 'KSysGuard' was not declared in this scope
/var/tmp/portage/dev-util/inspektor-9999/work/inspektor-9999/inspektor/src/centralwidget.cpp:137: error: template argument 1 is invalid
/var/tmp/portage/dev-util/inspektor-9999/work/inspektor-9999/inspektor/src/centralwidget.cpp:137: error: invalid type in declaration before '=' token
/var/tmp/portage/dev-util/inspektor-9999/work/inspektor-9999/inspektor/src/centralwidget.cpp:137: error: 'class Ui::AttachDialog' has no member named 'ksysguardprocesslist'
/var/tmp/portage/dev-util/inspektor-9999/work/inspektor-9999/inspektor/src/centralwidget.cpp:138: error: request for member 'empty' in 'selected', which is of non-class type 'int'
/var/tmp/portage/dev-util/inspektor-9999/work/inspektor-9999/inspektor/src/centralwidget.cpp:140: error: invalid types 'int[int]' for array subscript
[ 45%] make[2]: *** [inspektor/src/CMakeFiles/inspektor.dir/centralwidget.o] Error 1
make[2]: *** Waiting for unfinished jobs....
Building CXX object inspektor/src/CMakeFiles/inspektor.dir/decoder/connect.o
make[1]: *** [inspektor/src/CMakeFiles/inspektor.dir/all] Error 2
make[1]: *** Waiting for unfinished jobs....
[ 45%] Built target shamancore
make: *** [all] Error 2
[31;01m*[0m ERROR: dev-util/inspektor-9999 failed.
[31;01m*[0m Call stack:
[31;01m*[0m ebuild.sh, line 49: Called src_compile
[31;01m*[0m environment, line 3003: Called kde4overlay-meta_src_compile
[31;01m*[0m environment, line 2329: Called kde4overlay-meta_src_make
[31;01m*[0m environment, line 2378: Called kde4overlay-base_src_make
[31;01m*[0m environment, line 2089: Called cmake-utils_src_make
[31;01m*[0m environment, line 741: Called die
[31;01m*[0m The specific snippet of code:
[31;01m*[0m emake "$@" || die "Make failed!";
[31;01m*[0m The die message:
[31;01m*[0m Make failed!
[31;01m*[0m If you need support, post the topmost build error, and the call stack if relevant.
[31;01m*[0m A complete build log is located at '/var/tmp/portage/dev-util/inspektor-9999/temp/build.log'.
[31;01m*[0m The ebuild environment file is located at '/var/tmp/portage/dev-util/inspektor-9999/temp/environment'.
[31;01m*[0m This ebuild used the following eclasses from overlays:
[31;01m*[0m /usr/portage/local/layman/kdesvn-portage/eclass/kde4svn.eclass
[31;01m*[0m /usr/portage/local/layman/kdesvn-portage/eclass/kde4overlay-base.eclass
[31;01m*[0m /usr/portage/local/layman/kdesvn-portage/eclass/kde4overlay-functions.eclass
[31;01m*[0m /usr/portage/local/layman/kdesvn-portage/eclass/kde4overlay-meta.eclass