Automaton `athlon_mult'
16 NDFA states, 48 NDFA arcs
16 DFA states, 48 DFA arcs
16 minimal DFA states, 48 minimal DFA arcs
273 all insns 4 insn equivalence classes
50 transition comb vector els, 64 trans table els: use simple vect
50 state alts comb vector els, 64 state alts table els: use simple vect
64 min delay table els, compression factor 2
Automaton `athlon_fp'
15522 NDFA states, 99908 NDFA arcs
15522 DFA states, 99908 DFA arcs
463 minimal DFA states, 3038 minimal DFA arcs
273 all insns 21 insn equivalence classes
3057 transition comb vector els, 9723 trans table els: use comb vect
3057 state alts comb vector els, 9723 state alts table els: use comb vect
9723 min delay table els, compression factor 1
17533 all allocated states, 102661 all allocated arcs
32710 all allocated alternative states
6256 all transition comb vector els, 16780 all trans table els
6256 all state alts comb vector els, 16780 all state alts table els
16780 all min delay table els
0 locked states num
transformation: 0.020000, building DFA: 16.280000
DFA minimization: 0.440000, making insn equivalence: 0.000000
all automaton generation: 16.890000, output: 0.190000
/bin/sh /var/tmp/portage/sys-devel/gcc-4.1.2/work/gcc-4.1.2/gcc/../move-if-change tmp-attrtab.c insn-attrtab.c
insn-attrtab.c is unchanged
echo timestamp > s-attrtab
stage1/xgcc -Bstage1/ -B/usr/i486-pc-linux-gnu/bin/ -O2 -mtune=i686 -pipe -fprofile-generate -DIN_GCC -W -Wall -Wwrite-strings -Wstrict-prototypes -Wmissing-prototypes -pedantic -Wno-long-long -Wno-variadic-macros -Wold-style-definition -Wmissing-format-attribute -DHAVE_CONFIG_H -I. -I. -I/var/tmp/portage/sys-devel/gcc-4.1.2/work/gcc-4.1.2/gcc -I/var/tmp/portage/sys-devel/gcc-4.1.2/work/gcc-4.1.2/gcc/. -I/var/tmp/portage/sys-devel/gcc-4.1.2/work/gcc-4.1.2/gcc/../include -I/var/tmp/portage/sys-devel/gcc-4.1.2/work/gcc-4.1.2/gcc/../libcpp/include -c insn-attrtab.c \
-o insn-attrtab.o
{standard input}: Assembler messages:
{standard input}:35062: Warning: partial line at end of file ignored
xgcc: Internal error: Killed (program cc1)
Please submit a full bug report.
See <URL:http://bugs.gentoo.org/> for instructions.
make[2]: *** [insn-attrtab.o] Error 1
make[2]: Leaving directory `/var/tmp/portage/sys-devel/gcc-4.1.2/work/build/gcc'
make[1]: *** [stageprofile_build] Error 2
make[1]: Leaving directory `/var/tmp/portage/sys-devel/gcc-4.1.2/work/build/gcc'
make: *** [profiledbootstrap] Error 2
[31;01m*[0m
[31;01m*[0m ERROR: sys-devel/gcc-4.1.2 failed.
[31;01m*[0m Call stack:
[31;01m*[0m ebuild.sh, line 49: Called src_compile
[31;01m*[0m environment, line 4548: Called toolchain_src_compile
[31;01m*[0m environment, line 5065: Called gcc_src_compile
[31;01m*[0m environment, line 2912: Called gcc_do_make
[31;01m*[0m environment, line 2742: Called die
[31;01m*[0m The specific snippet of code:
[31;01m*[0m emake LDFLAGS="${LDFLAGS}" STAGE1_CFLAGS="${STAGE1_CFLAGS}" LIBPATH="${LIBPATH}" BOOT_CFLAGS="${BOOT_CFLAGS}" ${GCC_MAKE_TARGET} || die "emake failed with ${GCC_MAKE_TARGET}";
[31;01m*[0m The die message:
[31;01m*[0m emake failed with profiledbootstrap
[31;01m*[0m
[31;01m*[0m If you need support, post the topmost build error, and the call stack if relevant.
[31;01m*[0m A complete build log is located at '/var/tmp/portage/sys-devel/gcc-4.1.2/temp/build.log'.
[31;01m*[0m The ebuild environment file is located at '/var/tmp/portage/sys-devel/gcc-4.1.2/temp/environment'.
[31;01m*[0m