rendered paste body| /home/luke-jr/src/oe2005/build.alt/tmp/staging/x86_64-linux/bin/install -c -m 644 'cairo-xlib.h' '/home/luke-jr/src/oe2005/build.alt/tmp/work/cairo-0.0cvs20050430-r2/image/usr/include/cairo/cairo-xlib.h'
| ****************************************************************
| *** Error: Old headers found. You should remove the following
| *** files and then type 'make install' again.
| /usr/include/cairo-features.h
| /usr/include/cairo.h
| ****************************************************************
| make[2]: *** [install-data-local] Error 1
| make[2]: Leaving directory `/home/luke-jr/src/oe2005/build.alt/tmp/work/cairo-0.0cvs20050430-r2/cairo/src'
| make[1]: *** [install-am] Error 2
| make[1]: Leaving directory `/home/luke-jr/src/oe2005/build.alt/tmp/work/cairo-0.0cvs20050430-r2/cairo/src'
| make: *** [install-recursive] Error 1
| FATAL: oe_runmake failed
NOTE: Task failed:
NOTE: package cairo-0.0cvs20050430-r2: task do_package: failed
ERROR: TaskFailed event exception, aborting
NOTE: package cairo-0.0cvs20050430: failed
ERROR: Build of gpe-image failed