rendered paste bodyThis file contains any messages produced by compilers while
running configure, to aid debugging if configure makes a mistake.
It was created by glest configure 1.1.1, which was
generated by GNU Autoconf 2.59. Invocation command line was
$ ./configure --prefix=/usr --host=i686-pc-linux-gnu --mandir=/usr/share/man --infodir=/usr/share/info --datadir=/usr/share --sysconfdir=/etc --localstatedir=/var/lib --prefix=/usr/games --libdir=/usr/games/lib --datadir=/usr/share/games --sysconfdir=/etc/games --localstatedir=/var/games --with-vorbis=/usr --with-ogg=/usr --build=i686-pc-linux-gnu
## --------- ##
## Platform. ##
## --------- ##
hostname = hades
uname -m = i686
uname -r = 2.6.15-gentoo-r1
uname -s = Linux
uname -v = #7 SMP PREEMPT Fri May 5 15:28:57 CEST 2006
/usr/bin/uname -p = AMD Athlon(tm) XP 2000+
/bin/uname -X = unknown
/bin/arch = i686
/usr/bin/arch -k = unknown
/usr/convex/getsysinfo = unknown
hostinfo = unknown
/bin/machine = unknown
/usr/bin/oslevel = unknown
/bin/universe = unknown
PATH: /usr/local/sbin
PATH: /sbin
PATH: /usr/sbin
PATH: /usr/lib/portage/bin
PATH: /usr/local/bin
PATH: /bin
PATH: /usr/bin
PATH: /opt/bin
PATH: /usr/i686-pc-linux-gnu/gcc-bin/4.1.1
PATH: /opt/ati/bin
PATH: /opt/sun-jdk-1.5.0.06/bin
PATH: /opt/sun-jdk-1.5.0.06/jre/bin
PATH: /usr/kde/3.5/sbin
PATH: /usr/kde/3.5/bin
PATH: /usr/qt/3/bin
PATH: /usr/kde/3.3/sbin
PATH: /usr/kde/3.3/bin
PATH: /opt/vmware/bin
## ----------- ##
## Core tests. ##
## ----------- ##
configure:1388: checking build system type
configure:1406: result: i686-pc-linux-gnu
configure:1414: checking host system type
configure:1428: result: i686-pc-linux-gnu
configure:1436: checking target system type
configure:1450: result: i686-pc-linux-gnu
configure:1476: checking for i686-pc-linux-gnu-gcc
configure:1492: found /usr/bin/i686-pc-linux-gnu-gcc
configure:1502: result: i686-pc-linux-gnu-gcc
configure:1784: checking for C compiler version
configure:1787: i686-pc-linux-gnu-gcc --version </dev/null >&5
i686-pc-linux-gnu-gcc (GCC) 4.1.1 (Gentoo 4.1.1)
Copyright (C) 2006 Free Software Foundation, Inc.
This is free software; see the source for copying conditions. There is NO
warranty; not even for MERCHANTABILITY or FITNESS FOR A PARTICULAR PURPOSE.
configure:1790: $? = 0
configure:1792: i686-pc-linux-gnu-gcc -v </dev/null >&5
Using built-in specs.
Target: i686-pc-linux-gnu
Configured with: /var/tmp/portage/gcc-4.1.1/work/gcc-4.1.1/configure --prefix=/usr --bindir=/usr/i686-pc-linux-gnu/gcc-bin/4.1.1 --includedir=/usr/lib/gcc/i686-pc-linux-gnu/4.1.1/include --datadir=/usr/share/gcc-data/i686-pc-linux-gnu/4.1.1 --mandir=/usr/share/gcc-data/i686-pc-linux-gnu/4.1.1/man --infodir=/usr/share/gcc-data/i686-pc-linux-gnu/4.1.1/info --with-gxx-include-dir=/usr/lib/gcc/i686-pc-linux-gnu/4.1.1/include/g++-v4 --host=i686-pc-linux-gnu --build=i686-pc-linux-gnu --disable-altivec --enable-nls --without-included-gettext --with-system-zlib --disable-checking --disable-werror --disable-libunwind-exceptions --disable-multilib --disable-libmudflap --disable-libssp --disable-libgcj --enable-languages=c,c++,objc,obj-c++,fortran --enable-shared --enable-threads=posix --enable-__cxa_atexit --enable-clocale=gnu
Thread model: posix
gcc version 4.1.1 (Gentoo 4.1.1)
configure:1795: $? = 0
configure:1797: i686-pc-linux-gnu-gcc -V </dev/null >&5
i686-pc-linux-gnu-gcc: '-V' option must have argument
configure:1800: $? = 1
configure:1823: checking for C compiler default output file name
configure:1826: i686-pc-linux-gnu-gcc -march=athlon-xp -O2 -pipe -fomit-frame-pointer -mfpmath=sse -msse -mmmx -m3dnow -Wl,-O1 conftest.c >&5
configure:1829: $? = 0
configure:1875: result: a.out
configure:1880: checking whether the C compiler works
configure:1886: ./a.out
configure:1889: $? = 0
configure:1906: result: yes
configure:1913: checking whether we are cross compiling
configure:1915: result: no
configure:1918: checking for suffix of executables
configure:1920: i686-pc-linux-gnu-gcc -o conftest -march=athlon-xp -O2 -pipe -fomit-frame-pointer -mfpmath=sse -msse -mmmx -m3dnow -Wl,-O1 conftest.c >&5
configure:1923: $? = 0
configure:1948: result:
configure:1954: checking for suffix of object files
configure:1975: i686-pc-linux-gnu-gcc -c -march=athlon-xp -O2 -pipe -fomit-frame-pointer -mfpmath=sse -msse -mmmx -m3dnow conftest.c >&5
configure:1978: $? = 0
configure:2000: result: o
configure:2004: checking whether we are using the GNU C compiler
configure:2028: i686-pc-linux-gnu-gcc -c -march=athlon-xp -O2 -pipe -fomit-frame-pointer -mfpmath=sse -msse -mmmx -m3dnow conftest.c >&5
configure:2034: $? = 0
configure:2038: test -z
|| test ! -s conftest.err
configure:2041: $? = 0
configure:2044: test -s conftest.o
configure:2047: $? = 0
configure:2060: result: yes
configure:2066: checking whether i686-pc-linux-gnu-gcc accepts -g
configure:2087: i686-pc-linux-gnu-gcc -c -g conftest.c >&5
configure:2093: $? = 0
configure:2097: test -z
|| test ! -s conftest.err
configure:2100: $? = 0
configure:2103: test -s conftest.o
configure:2106: $? = 0
configure:2117: result: yes
configure:2134: checking for i686-pc-linux-gnu-gcc option to accept ANSI C
configure:2204: i686-pc-linux-gnu-gcc -c -march=athlon-xp -O2 -pipe -fomit-frame-pointer -mfpmath=sse -msse -mmmx -m3dnow conftest.c >&5
configure:2210: $? = 0
configure:2214: test -z
|| test ! -s conftest.err
configure:2217: $? = 0
configure:2220: test -s conftest.o
configure:2223: $? = 0
configure:2241: result: none needed
configure:2259: i686-pc-linux-gnu-gcc -c -march=athlon-xp -O2 -pipe -fomit-frame-pointer -mfpmath=sse -msse -mmmx -m3dnow conftest.c >&5
conftest.c:2: error: expected '=', ',', ';', 'asm' or '__attribute__' before 'me'
configure:2265: $? = 1
configure: failed program was:
| #ifndef __cplusplus
| choke me
| #endif
configure:2399: checking whether byte ordering is bigendian
configure:2426: i686-pc-linux-gnu-gcc -c -march=athlon-xp -O2 -pipe -fomit-frame-pointer -mfpmath=sse -msse -mmmx -m3dnow conftest.c >&5
configure:2432: $? = 0
configure:2436: test -z
|| test ! -s conftest.err
configure:2439: $? = 0
configure:2442: test -s conftest.o
configure:2445: $? = 0
configure:2469: i686-pc-linux-gnu-gcc -c -march=athlon-xp -O2 -pipe -fomit-frame-pointer -mfpmath=sse -msse -mmmx -m3dnow conftest.c >&5
conftest.c: In function 'main':
conftest.c:16: error: 'not' undeclared (first use in this function)
conftest.c:16: error: (Each undeclared identifier is reported only once
conftest.c:16: error: for each function it appears in.)
conftest.c:16: error: expected ';' before 'big'
configure:2475: $? = 1
configure: failed program was:
| /* confdefs.h. */
|
| #define PACKAGE_NAME "glest"
| #define PACKAGE_TARNAME "glest"
| #define PACKAGE_VERSION "1.1.1"
| #define PACKAGE_STRING "glest 1.1.1"
| #define PACKAGE_BUGREPORT "matze@braunis.de"
| /* end confdefs.h. */
| #include <sys/types.h>
| #include <sys/param.h>
|
| int
| main ()
| {
| #if BYTE_ORDER != BIG_ENDIAN
| not big endian
| #endif
|
| ;
| return 0;
| }
configure:2610: result: no
configure:2669: checking for i686-pc-linux-gnu-g++
configure:2685: found /usr/bin/i686-pc-linux-gnu-g++
configure:2695: result: i686-pc-linux-gnu-g++
configure:2753: checking for C++ compiler version
configure:2756: i686-pc-linux-gnu-g++ --version </dev/null >&5
i686-pc-linux-gnu-g++ (GCC) 4.1.1 (Gentoo 4.1.1)
Copyright (C) 2006 Free Software Foundation, Inc.
This is free software; see the source for copying conditions. There is NO
warranty; not even for MERCHANTABILITY or FITNESS FOR A PARTICULAR PURPOSE.
configure:2759: $? = 0
configure:2761: i686-pc-linux-gnu-g++ -v </dev/null >&5
Using built-in specs.
Target: i686-pc-linux-gnu
Configured with: /var/tmp/portage/gcc-4.1.1/work/gcc-4.1.1/configure --prefix=/usr --bindir=/usr/i686-pc-linux-gnu/gcc-bin/4.1.1 --includedir=/usr/lib/gcc/i686-pc-linux-gnu/4.1.1/include --datadir=/usr/share/gcc-data/i686-pc-linux-gnu/4.1.1 --mandir=/usr/share/gcc-data/i686-pc-linux-gnu/4.1.1/man --infodir=/usr/share/gcc-data/i686-pc-linux-gnu/4.1.1/info --with-gxx-include-dir=/usr/lib/gcc/i686-pc-linux-gnu/4.1.1/include/g++-v4 --host=i686-pc-linux-gnu --build=i686-pc-linux-gnu --disable-altivec --enable-nls --without-included-gettext --with-system-zlib --disable-checking --disable-werror --disable-libunwind-exceptions --disable-multilib --disable-libmudflap --disable-libssp --disable-libgcj --enable-languages=c,c++,objc,obj-c++,fortran --enable-shared --enable-threads=posix --enable-__cxa_atexit --enable-clocale=gnu
Thread model: posix
gcc version 4.1.1 (Gentoo 4.1.1)
configure:2764: $? = 0
configure:2766: i686-pc-linux-gnu-g++ -V </dev/null >&5
i686-pc-linux-gnu-g++: '-V' option must have argument
configure:2769: $? = 1
configure:2772: checking whether we are using the GNU C++ compiler
configure:2796: i686-pc-linux-gnu-g++ -c -march=athlon-xp -O2 -s -pipe -mfpmath=sse -msse -mmmx -m3dnow conftest.cc >&5
configure:2802: $? = 0
configure:2806: test -z
|| test ! -s conftest.err
configure:2809: $? = 0
configure:2812: test -s conftest.o
configure:2815: $? = 0
configure:2828: result: yes
configure:2834: checking whether i686-pc-linux-gnu-g++ accepts -g
configure:2855: i686-pc-linux-gnu-g++ -c -g conftest.cc >&5
configure:2861: $? = 0
configure:2865: test -z
|| test ! -s conftest.err
configure:2868: $? = 0
configure:2871: test -s conftest.o
configure:2874: $? = 0
configure:2885: result: yes
configure:2927: i686-pc-linux-gnu-g++ -c -march=athlon-xp -O2 -s -pipe -mfpmath=sse -msse -mmmx -m3dnow conftest.cc >&5
configure:2933: $? = 0
configure:2937: test -z
|| test ! -s conftest.err
configure:2940: $? = 0
configure:2943: test -s conftest.o
configure:2946: $? = 0
configure:2972: i686-pc-linux-gnu-g++ -c -march=athlon-xp -O2 -s -pipe -mfpmath=sse -msse -mmmx -m3dnow conftest.cc >&5
conftest.cc: In function 'int main()':
conftest.cc:13: error: 'exit' was not declared in this scope
configure:2978: $? = 1
configure: failed program was:
| /* confdefs.h. */
|
| #define PACKAGE_NAME "glest"
| #define PACKAGE_TARNAME "glest"
| #define PACKAGE_VERSION "1.1.1"
| #define PACKAGE_STRING "glest 1.1.1"
| #define PACKAGE_BUGREPORT "matze@braunis.de"
| /* end confdefs.h. */
|
| int
| main ()
| {
| exit (42);
| ;
| return 0;
| }
configure:2927: i686-pc-linux-gnu-g++ -c -march=athlon-xp -O2 -s -pipe -mfpmath=sse -msse -mmmx -m3dnow conftest.cc >&5
configure:2933: $? = 0
configure:2937: test -z
|| test ! -s conftest.err
configure:2940: $? = 0
configure:2943: test -s conftest.o
configure:2946: $? = 0
configure:2972: i686-pc-linux-gnu-g++ -c -march=athlon-xp -O2 -s -pipe -mfpmath=sse -msse -mmmx -m3dnow conftest.cc >&5
configure:2978: $? = 0
configure:2982: test -z
|| test ! -s conftest.err
configure:2985: $? = 0
configure:2988: test -s conftest.o
configure:2991: $? = 0
configure:3027: checking for a BSD-compatible install
configure:3082: result: /bin/install -c
configure:3095: checking whether g++ is new enough
configure:3129: i686-pc-linux-gnu-g++ -c -march=athlon-xp -O2 -s -pipe -mfpmath=sse -msse -mmmx -m3dnow conftest.cc >&5
configure:3135: $? = 0
configure:3139: test -z
|| test ! -s conftest.err
configure:3142: $? = 0
configure:3145: test -s conftest.o
configure:3148: $? = 0
configure:3150: result: yes
configure:3177: checking for doxygen
configure:3193: found /usr/bin/doxygen
configure:3203: result: doxygen
configure:3217: checking for target host
configure:3233: result: assume posix
configure:3246: checking how to run the C preprocessor
configure:3281: i686-pc-linux-gnu-gcc -E conftest.c
configure:3287: $? = 0
configure:3319: i686-pc-linux-gnu-gcc -E conftest.c
conftest.c:13:28: error: ac_nonexistent.h: No such file or directory
configure:3325: $? = 1
configure: failed program was:
| /* confdefs.h. */
|
| #define PACKAGE_NAME "glest"
| #define PACKAGE_TARNAME "glest"
| #define PACKAGE_VERSION "1.1.1"
| #define PACKAGE_STRING "glest 1.1.1"
| #define PACKAGE_BUGREPORT "matze@braunis.de"
| #ifdef __cplusplus
| extern "C" void std::exit (int) throw (); using std::exit;
| #endif
| #define USE_POSIX_SOCKETS
| /* end confdefs.h. */
| #include <ac_nonexistent.h>
configure:3364: result: i686-pc-linux-gnu-gcc -E
configure:3388: i686-pc-linux-gnu-gcc -E conftest.c
configure:3394: $? = 0
configure:3426: i686-pc-linux-gnu-gcc -E conftest.c
conftest.c:13:28: error: ac_nonexistent.h: No such file or directory
configure:3432: $? = 1
configure: failed program was:
| /* confdefs.h. */
|
| #define PACKAGE_NAME "glest"
| #define PACKAGE_TARNAME "glest"
| #define PACKAGE_VERSION "1.1.1"
| #define PACKAGE_STRING "glest 1.1.1"
| #define PACKAGE_BUGREPORT "matze@braunis.de"
| #ifdef __cplusplus
| extern "C" void std::exit (int) throw (); using std::exit;
| #endif
| #define USE_POSIX_SOCKETS
| /* end confdefs.h. */
| #include <ac_nonexistent.h>
configure:3476: checking for X
configure:3581: i686-pc-linux-gnu-gcc -E conftest.c
configure:3587: $? = 0
configure:3637: i686-pc-linux-gnu-gcc -o conftest -march=athlon-xp -O2 -pipe -fomit-frame-pointer -mfpmath=sse -msse -mmmx -m3dnow -Wl,-O1 conftest.c -lXt >&5
configure:3643: $? = 0
configure:3647: test -z
|| test ! -s conftest.err
configure:3650: $? = 0
configure:3653: test -s conftest
configure:3656: $? = 0
configure:3706: result: libraries , headers
configure:3727: checking for egrep
configure:3737: result: grep -E
configure:3742: checking for ANSI C header files
configure:3767: i686-pc-linux-gnu-gcc -c -march=athlon-xp -O2 -pipe -fomit-frame-pointer -mfpmath=sse -msse -mmmx -m3dnow conftest.c >&5
configure:3773: $? = 0
configure:3777: test -z
|| test ! -s conftest.err
configure:3780: $? = 0
configure:3783: test -s conftest.o
configure:3786: $? = 0
configure:3875: i686-pc-linux-gnu-gcc -o conftest -march=athlon-xp -O2 -pipe -fomit-frame-pointer -mfpmath=sse -msse -mmmx -m3dnow -Wl,-O1 conftest.c >&5
conftest.c: In function 'main':
conftest.c:31: warning: incompatible implicit declaration of built-in function 'exit'
configure:3878: $? = 0
configure:3880: ./conftest
configure:3883: $? = 0
configure:3898: result: yes
configure:3922: checking for sys/types.h
configure:3938: i686-pc-linux-gnu-gcc -c -march=athlon-xp -O2 -pipe -fomit-frame-pointer -mfpmath=sse -msse -mmmx -m3dnow conftest.c >&5
configure:3944: $? = 0
configure:3948: test -z
|| test ! -s conftest.err
configure:3951: $? = 0
configure:3954: test -s conftest.o
configure:3957: $? = 0
configure:3968: result: yes
configure:3922: checking for sys/stat.h
configure:3938: i686-pc-linux-gnu-gcc -c -march=athlon-xp -O2 -pipe -fomit-frame-pointer -mfpmath=sse -msse -mmmx -m3dnow conftest.c >&5
configure:3944: $? = 0
configure:3948: test -z
|| test ! -s conftest.err
configure:3951: $? = 0
configure:3954: test -s conftest.o
configure:3957: $? = 0
configure:3968: result: yes
configure:3922: checking for stdlib.h
configure:3938: i686-pc-linux-gnu-gcc -c -march=athlon-xp -O2 -pipe -fomit-frame-pointer -mfpmath=sse -msse -mmmx -m3dnow conftest.c >&5
configure:3944: $? = 0
configure:3948: test -z
|| test ! -s conftest.err
configure:3951: $? = 0
configure:3954: test -s conftest.o
configure:3957: $? = 0
configure:3968: result: yes
configure:3922: checking for string.h
configure:3938: i686-pc-linux-gnu-gcc -c -march=athlon-xp -O2 -pipe -fomit-frame-pointer -mfpmath=sse -msse -mmmx -m3dnow conftest.c >&5
configure:3944: $? = 0
configure:3948: test -z
|| test ! -s conftest.err
configure:3951: $? = 0
configure:3954: test -s conftest.o
configure:3957: $? = 0
configure:3968: result: yes
configure:3922: checking for memory.h
configure:3938: i686-pc-linux-gnu-gcc -c -march=athlon-xp -O2 -pipe -fomit-frame-pointer -mfpmath=sse -msse -mmmx -m3dnow conftest.c >&5
configure:3944: $? = 0
configure:3948: test -z
|| test ! -s conftest.err
configure:3951: $? = 0
configure:3954: test -s conftest.o
configure:3957: $? = 0
configure:3968: result: yes
configure:3922: checking for strings.h
configure:3938: i686-pc-linux-gnu-gcc -c -march=athlon-xp -O2 -pipe -fomit-frame-pointer -mfpmath=sse -msse -mmmx -m3dnow conftest.c >&5
configure:3944: $? = 0
configure:3948: test -z
|| test ! -s conftest.err
configure:3951: $? = 0
configure:3954: test -s conftest.o
configure:3957: $? = 0
configure:3968: result: yes
configure:3922: checking for inttypes.h
configure:3938: i686-pc-linux-gnu-gcc -c -march=athlon-xp -O2 -pipe -fomit-frame-pointer -mfpmath=sse -msse -mmmx -m3dnow conftest.c >&5
configure:3944: $? = 0
configure:3948: test -z
|| test ! -s conftest.err
configure:3951: $? = 0
configure:3954: test -s conftest.o
configure:3957: $? = 0
configure:3968: result: yes
configure:3922: checking for stdint.h
configure:3938: i686-pc-linux-gnu-gcc -c -march=athlon-xp -O2 -pipe -fomit-frame-pointer -mfpmath=sse -msse -mmmx -m3dnow conftest.c >&5
configure:3944: $? = 0
configure:3948: test -z
|| test ! -s conftest.err
configure:3951: $? = 0
configure:3954: test -s conftest.o
configure:3957: $? = 0
configure:3968: result: yes
configure:3922: checking for unistd.h
configure:3938: i686-pc-linux-gnu-gcc -c -march=athlon-xp -O2 -pipe -fomit-frame-pointer -mfpmath=sse -msse -mmmx -m3dnow conftest.c >&5
configure:3944: $? = 0
configure:3948: test -z
|| test ! -s conftest.err
configure:3951: $? = 0
configure:3954: test -s conftest.o
configure:3957: $? = 0
configure:3968: result: yes
configure:3994: checking glob.h usability
configure:4006: i686-pc-linux-gnu-gcc -c -march=athlon-xp -O2 -pipe -fomit-frame-pointer -mfpmath=sse -msse -mmmx -m3dnow conftest.c >&5
configure:4012: $? = 0
configure:4016: test -z
|| test ! -s conftest.err
configure:4019: $? = 0
configure:4022: test -s conftest.o
configure:4025: $? = 0
configure:4035: result: yes
configure:4039: checking glob.h presence
configure:4049: i686-pc-linux-gnu-gcc -E conftest.c
configure:4055: $? = 0
configure:4075: result: yes
configure:4110: checking for glob.h
configure:4117: result: yes
configure:4131: checking for socklen_t
configure:4154: i686-pc-linux-gnu-gcc -c -march=athlon-xp -O2 -pipe -fomit-frame-pointer -mfpmath=sse -msse -mmmx -m3dnow conftest.c >&5
configure:4160: $? = 0
configure:4164: test -z
|| test ! -s conftest.err
configure:4167: $? = 0
configure:4170: test -s conftest.o
configure:4173: $? = 0
configure:4185: result: yes
configure:4237: checking for sdl-config
configure:4255: found /usr/bin/sdl-config
configure:4268: result: /usr/bin/sdl-config
configure:4276: checking for SDL - version >= 1.2.5
configure:4366: i686-pc-linux-gnu-gcc -o conftest -march=athlon-xp -O2 -pipe -fomit-frame-pointer -mfpmath=sse -msse -mmmx -m3dnow -I/usr/include/SDL -D_REENTRANT -Wl,-O1 conftest.c -lSDL -lpthread >&5
configure:4369: $? = 0
configure:4371: ./conftest
configure:4374: $? = 0
configure:4392: result: yes
configure:4539: checking for xerces
configure:4555: i686-pc-linux-gnu-g++ -o conftest -march=athlon-xp -O2 -s -pipe -mfpmath=sse -msse -mmmx -m3dnow -Wl,-O1 conftest.cc -lxerces-c -lpthread >&5
configure:4561: $? = 0
configure:4565: test -z
|| test ! -s conftest.err
configure:4568: $? = 0
configure:4571: test -s conftest
configure:4574: $? = 0
configure:4591: result: found
configure:4654: checking for OpenAL
configure:4669: i686-pc-linux-gnu-gcc -o conftest -march=athlon-xp -O2 -pipe -fomit-frame-pointer -mfpmath=sse -msse -mmmx -m3dnow -Wl,-O1 conftest.c -lopenal >&5
/usr/lib/libsmpeg-0.4.so.0: undefined reference to `_Unwind_GetIP'
/usr/lib/libsmpeg-0.4.so.0: undefined reference to `_Unwind_Resume_or_Rethrow'
/usr/lib/libsmpeg-0.4.so.0: undefined reference to `_Unwind_GetRegionStart'
/usr/lib/libsmpeg-0.4.so.0: undefined reference to `_Unwind_Resume'
/usr/lib/libsmpeg-0.4.so.0: undefined reference to `_Unwind_DeleteException'
/usr/lib/libsmpeg-0.4.so.0: undefined reference to `_Unwind_RaiseException'
/usr/lib/libsmpeg-0.4.so.0: undefined reference to `_Unwind_SetIP'
/usr/lib/libsmpeg-0.4.so.0: undefined reference to `_Unwind_GetTextRelBase'
/usr/lib/libsmpeg-0.4.so.0: undefined reference to `_Unwind_GetLanguageSpecificData'
/usr/lib/libsmpeg-0.4.so.0: undefined reference to `_Unwind_SetGR'
/usr/lib/libsmpeg-0.4.so.0: undefined reference to `_Unwind_GetDataRelBase'
collect2: ld returned 1 exit status
configure:4675: $? = 1
configure: failed program was:
| #include <AL/al.h>
| int
| main(int argc, char** argv)
| {
| alcOpenDevice(0);
| ;
| return 0;
| }
|
configure:4711: result: not found
configure:4726: error: Please intall OpenAL
## ---------------- ##
## Cache variables. ##
## ---------------- ##
ac_cv_build=i686-pc-linux-gnu
ac_cv_build_alias=i686-pc-linux-gnu
ac_cv_c_bigendian=no
ac_cv_c_compiler_gnu=yes
ac_cv_cxx_compiler_gnu=yes
ac_cv_env_CC_set=''
ac_cv_env_CC_value=''
ac_cv_env_CFLAGS_set=set
ac_cv_env_CFLAGS_value='-march=athlon-xp -O2 -pipe -fomit-frame-pointer -mfpmath=sse -msse -mmmx -m3dnow'
ac_cv_env_CPPFLAGS_set=''
ac_cv_env_CPPFLAGS_value=''
ac_cv_env_CPP_set=''
ac_cv_env_CPP_value=''
ac_cv_env_CXXFLAGS_set=set
ac_cv_env_CXXFLAGS_value='-march=athlon-xp -O2 -s -pipe -mfpmath=sse -msse -mmmx -m3dnow'
ac_cv_env_CXX_set=''
ac_cv_env_CXX_value=''
ac_cv_env_LDFLAGS_set=set
ac_cv_env_LDFLAGS_value=-Wl,-O1
ac_cv_env_build_alias_set=set
ac_cv_env_build_alias_value=i686-pc-linux-gnu
ac_cv_env_host_alias_set=set
ac_cv_env_host_alias_value=i686-pc-linux-gnu
ac_cv_env_target_alias_set=''
ac_cv_env_target_alias_value=''
ac_cv_exeext=''
ac_cv_have_x='have_x=yes ac_x_includes= ac_x_libraries='
ac_cv_header_glob_h=yes
ac_cv_header_inttypes_h=yes
ac_cv_header_memory_h=yes
ac_cv_header_stdc=yes
ac_cv_header_stdint_h=yes
ac_cv_header_stdlib_h=yes
ac_cv_header_string_h=yes
ac_cv_header_strings_h=yes
ac_cv_header_sys_stat_h=yes
ac_cv_header_sys_types_h=yes
ac_cv_header_unistd_h=yes
ac_cv_host=i686-pc-linux-gnu
ac_cv_host_alias=i686-pc-linux-gnu
ac_cv_objext=o
ac_cv_path_SDL_CONFIG=/usr/bin/sdl-config
ac_cv_path_install='/bin/install -c'
ac_cv_prog_CC=i686-pc-linux-gnu-gcc
ac_cv_prog_CPP='i686-pc-linux-gnu-gcc -E'
ac_cv_prog_CXX=i686-pc-linux-gnu-g++
ac_cv_prog_DOXYGEN=doxygen
ac_cv_prog_cc_g=yes
ac_cv_prog_cc_stdc=''
ac_cv_prog_cxx_g=yes
ac_cv_prog_egrep='grep -E'
ac_cv_target=i686-pc-linux-gnu
ac_cv_target_alias=i686-pc-linux-gnu
ac_cv_type_socklen_t=yes
## ----------------- ##
## Output variables. ##
## ----------------- ##
CC='i686-pc-linux-gnu-gcc'
CFLAGS='-march=athlon-xp -O2 -pipe -fomit-frame-pointer -mfpmath=sse -msse -mmmx -m3dnow'
CPP='i686-pc-linux-gnu-gcc -E'
CPPFLAGS=''
CXX='i686-pc-linux-gnu-g++'
CXXFLAGS='-march=athlon-xp -O2 -s -pipe -mfpmath=sse -msse -mmmx -m3dnow'
DEFS=''
DOXYGEN='doxygen'
ECHO_C=''
ECHO_N='-n'
ECHO_T=''
EGREP='grep -E'
EXEEXT=''
GLU_CFLAGS=''
GLU_LIBS=''
GL_CFLAGS=''
GL_LIBS=''
INSTALL='/bin/install -c'
INSTALL_DATA='${INSTALL} -m 644'
INSTALL_PROGRAM='${INSTALL}'
INSTALL_SCRIPT='${INSTALL}'
LDFLAGS='-Wl,-O1'
LIBOBJS=''
LIBS=''
LTLIBOBJS=''
OBJEXT='o'
OGG_CFLAGS=''
OGG_LIBS=''
OPENAL_AVAILABLE='no'
OPENAL_CFLAGS=''
OPENAL_LIBS=''
PACKAGE_BUGREPORT='matze@braunis.de'
PACKAGE_NAME='glest'
PACKAGE_STRING='glest 1.1.1'
PACKAGE_TARNAME='glest'
PACKAGE_VERSION='1.1.1'
PATH_SEPARATOR=':'
PTHREAD_CC=''
PTHREAD_CFLAGS=''
PTHREAD_LIBS=''
SDL_CFLAGS='-I/usr/include/SDL -D_REENTRANT'
SDL_CONFIG='/usr/bin/sdl-config'
SDL_LIBS='-lSDL -lpthread'
SHELL='/bin/sh'
VARIANT='optimize'
VORBISENC_LIBS=''
VORBISFILE_LIBS=''
VORBIS_CFLAGS=''
VORBIS_LIBS=''
WX_AVAILABLE=''
WX_CFLAGS=''
WX_CFLAGS_ONLY=''
WX_CONFIG_PATH=''
WX_CPPFLAGS=''
WX_CXXFLAGS=''
WX_CXXFLAGS_ONLY=''
WX_LIBS=''
WX_VERSION=''
XERCES_AVAILABLE='yes'
XERCES_CFLAGS=''
XERCES_LIBS='-lxerces-c -lpthread'
ac_ct_CC=''
ac_ct_CXX=''
acx_pthread_config=''
bindir='${exec_prefix}/bin'
build='i686-pc-linux-gnu'
build_alias='i686-pc-linux-gnu'
build_cpu='i686'
build_os='linux-gnu'
build_vendor='pc'
datadir='/usr/share/games'
exec_prefix='NONE'
host='i686-pc-linux-gnu'
host_alias='i686-pc-linux-gnu'
host_cpu='i686'
host_os='linux-gnu'
host_vendor='pc'
includedir='${prefix}/include'
infodir='/usr/share/info'
libdir='/usr/games/lib'
libexecdir='${exec_prefix}/libexec'
localstatedir='/var/games'
mandir='/usr/share/man'
oldincludedir='/usr/include'
prefix='/usr/games'
program_transform_name='s,x,x,'
sbindir='${exec_prefix}/sbin'
sharedstatedir='${prefix}/com'
sysconfdir='/etc/games'
target='i686-pc-linux-gnu'
target_alias=''
target_cpu='i686'
target_os='linux-gnu'
target_vendor='pc'
## ----------- ##
## confdefs.h. ##
## ----------- ##
#define HAVE_GLOB_H 1
#define HAVE_INTTYPES_H 1
#define HAVE_MEMORY_H 1
#define HAVE_STDINT_H 1
#define HAVE_STDLIB_H 1
#define HAVE_STRINGS_H 1
#define HAVE_STRING_H 1
#define HAVE_SYS_STAT_H 1
#define HAVE_SYS_TYPES_H 1
#define HAVE_UNISTD_H 1
#define PACKAGE_BUGREPORT "matze@braunis.de"
#define PACKAGE_NAME "glest"
#define PACKAGE_STRING "glest 1.1.1"
#define PACKAGE_TARNAME "glest"
#define PACKAGE_VERSION "1.1.1"
#define STDC_HEADERS 1
#define USE_POSIX_SOCKETS
#define USE_SDL
#define X11_AVAILABLE 1
#endif
#ifdef __cplusplus
extern "C" void std::exit (int) throw (); using std::exit;
configure: exit 1