dapet@DanielsCom:~/ndiswrapper-1.21$ sudo make install
Password:
make -C driver install
make[1]: Går til katalog '/home/dapet/ndiswrapper-1.21/driver'
Can't find kernel build files in /lib/modules/2.6.15-26-386/build;
give the path to kernel build directory with
KBUILD=<path> argument to make
make[1]: *** [prereq_check] Fejl 1
make[1]: Forlader katalog '/home/dapet/ndiswrapper-1.21/driver'
make: *** [install] Fejl 2
dapet@DanielsCom:~/ndiswrapper-1.21$ make distclean
make -C driver clean
make[1]: Går til katalog '/home/dapet/ndiswrapper-1.21/driver'
rm -rf ndiswrapper.ko ndiswrapper.o hal.o iw_ndis.o loader.o misc_funcs.o ndis.o ntoskernel.o ntoskernel_io.o pe_linker.o pnp.o proc.o wrapmem.o wrapndis.o wrapper.o divdi3.o usb.o x86_64_stubs.o \
divdi3.o workqueue.o .*.ko.cmd .*.o.cmd \
ndiswrapper.mod.[oc] *~ .tmp_versions
make[1]: Forlader katalog '/home/dapet/ndiswrapper-1.21/driver'
make -C utils clean
make[1]: Går til katalog '/home/dapet/ndiswrapper-1.21/utils'
rm -f *~ *.o loadndisdriver
make[1]: Forlader katalog '/home/dapet/ndiswrapper-1.21/utils'
rm -f *~
rm -fr ndiswrapper-1.21 ndiswrapper-1.21.tar.gz patch-stamp
make -C driver distclean
make[1]: Går til katalog '/home/dapet/ndiswrapper-1.21/driver'
rm -rf ndiswrapper.ko ndiswrapper.o hal.o iw_ndis.o loader.o misc_funcs.o ndis.o ntoskernel.o ntoskernel_io.o pe_linker.o pnp.o proc.o wrapmem.o wrapndis.o wrapper.o divdi3.o usb.o x86_64_stubs.o \
divdi3.o workqueue.o .*.ko.cmd .*.o.cmd \
ndiswrapper.mod.[oc] *~ .tmp_versions
rm -f *_exports.h .\#* x86_64_stubs.h
make[1]: Forlader katalog '/home/dapet/ndiswrapper-1.21/driver'
make -C utils distclean
make[1]: Går til katalog '/home/dapet/ndiswrapper-1.21/utils'
rm -f *~ *.o loadndisdriver
rm -f .\#*
make[1]: Forlader katalog '/home/dapet/ndiswrapper-1.21/utils'
rm -f .\#*
dapet@DanielsCom:~/ndiswrapper-1.21$ make
make -C driver
make[1]: Går til katalog '/home/dapet/ndiswrapper-1.21/driver'
Can't find kernel build files in /lib/modules/2.6.15-26-386/build;
give the path to kernel build directory with
KBUILD=<path> argument to make
make[1]: *** [prereq_check] Fejl 1
make[1]: Forlader katalog '/home/dapet/ndiswrapper-1.21/driver'
make: *** [all] Fejl 2
dapet@DanielsCom:~/ndiswrapper-1.21$
dapet@DanielsCom:~/ndiswrapper-1.21$ make distclean
make -C driver clean
make[1]: Går til katalog '/home/dapet/ndiswrapper-1.21/driver'
rm -rf ndiswrapper.ko ndiswrapper.o hal.o iw_ndis.o loader.o misc_funcs.o ndis.o ntoskernel.o ntoskernel_io.o pe_linker.o pnp.o proc.o wrapmem.o wrapndis.o wrapper.o usb.o divdi3.o usb.o x86_64_stubs.o \
divdi3.o workqueue.o .*.ko.cmd .*.o.cmd \
ndiswrapper.mod.[oc] *~ .tmp_versions
make[1]: Forlader katalog '/home/dapet/ndiswrapper-1.21/driver'
make -C utils clean
make[1]: Går til katalog '/home/dapet/ndiswrapper-1.21/utils'
rm -f *~ *.o loadndisdriver
make[1]: Forlader katalog '/home/dapet/ndiswrapper-1.21/utils'
rm -f *~
rm -fr ndiswrapper-1.21 ndiswrapper-1.21.tar.gz patch-stamp
make -C driver distclean
make[1]: Går til katalog '/home/dapet/ndiswrapper-1.21/driver'
rm -rf ndiswrapper.ko ndiswrapper.o hal.o iw_ndis.o loader.o misc_funcs.o ndis.o ntoskernel.o ntoskernel_io.o pe_linker.o pnp.o proc.o wrapmem.o wrapndis.o wrapper.o usb.o divdi3.o usb.o x86_64_stubs.o \
divdi3.o workqueue.o .*.ko.cmd .*.o.cmd \
ndiswrapper.mod.[oc] *~ .tmp_versions
rm -f *_exports.h .\#* x86_64_stubs.h
make[1]: Forlader katalog '/home/dapet/ndiswrapper-1.21/driver'
make -C utils distclean
make[1]: Går til katalog '/home/dapet/ndiswrapper-1.21/utils'
rm -f *~ *.o loadndisdriver
rm -f .\#*
make[1]: Forlader katalog '/home/dapet/ndiswrapper-1.21/utils'
rm -f .\#*
dapet@DanielsCom:~/ndiswrapper-1.21$ make
make -C driver
make[1]: Går til katalog '/home/dapet/ndiswrapper-1.21/driver'
make -C /lib/modules/2.6.15-26-386/build SUBDIRS=/home/dapet/ndiswrapper-1.21/driver \
DRIVER_VERSION=1.21
make[2]: Går til katalog '/usr/src/linux-headers-2.6.15-26-386'
LD /home/dapet/ndiswrapper-1.21/driver/built-in.o
CC [M] /home/dapet/ndiswrapper-1.21/driver/hal.o
CC [M] /home/dapet/ndiswrapper-1.21/driver/iw_ndis.o
CC [M] /home/dapet/ndiswrapper-1.21/driver/loader.o
CC [M] /home/dapet/ndiswrapper-1.21/driver/misc_funcs.o
CC [M] /home/dapet/ndiswrapper-1.21/driver/ndis.o
CC [M] /home/dapet/ndiswrapper-1.21/driver/ntoskernel.o
CC [M] /home/dapet/ndiswrapper-1.21/driver/ntoskernel_io.o
CC [M] /home/dapet/ndiswrapper-1.21/driver/pe_linker.o
CC [M] /home/dapet/ndiswrapper-1.21/driver/pnp.o
CC [M] /home/dapet/ndiswrapper-1.21/driver/proc.o
CC [M] /home/dapet/ndiswrapper-1.21/driver/wrapmem.o
CC [M] /home/dapet/ndiswrapper-1.21/driver/wrapndis.o
CC [M] /home/dapet/ndiswrapper-1.21/driver/wrapper.o
CC [M] /home/dapet/ndiswrapper-1.21/driver/usb.o
CC [M] /home/dapet/ndiswrapper-1.21/driver/divdi3.o
LD [M] /home/dapet/ndiswrapper-1.21/driver/ndiswrapper.o
Building modules, stage 2.
MODPOST
CC /home/dapet/ndiswrapper-1.21/driver/ndiswrapper.mod.o
LD [M] /home/dapet/ndiswrapper-1.21/driver/ndiswrapper.ko
make[2]: Forlader katalog '/usr/src/linux-headers-2.6.15-26-386'
make[1]: Forlader katalog '/home/dapet/ndiswrapper-1.21/driver'
make -C utils
make[1]: Går til katalog '/home/dapet/ndiswrapper-1.21/utils'
gcc -g -Wall -DUTILS_VERSION=\"1.8\" -o loadndisdriver loadndisdriver.c
loadndisdriver.c:15:20: error: stdlib.h: Ingen sådan fil eller filkatalog
loadndisdriver.c:16:19: error: stdio.h: Ingen sådan fil eller filkatalog
loadndisdriver.c:17:19: error: errno.h: Ingen sådan fil eller filkatalog
loadndisdriver.c:18:20: error: string.h: Ingen sådan fil eller filkatalog
loadndisdriver.c:19:20: error: libgen.h: Ingen sådan fil eller filkatalog
loadndisdriver.c:21:22: error: sys/mman.h: Ingen sådan fil eller filkatalog
loadndisdriver.c:23:23: error: sys/types.h: Ingen sådan fil eller filkatalog
loadndisdriver.c:24:23: error: sys/ioctl.h: Ingen sådan fil eller filkatalog
loadndisdriver.c:25:22: error: sys/stat.h: Ingen sådan fil eller filkatalog
loadndisdriver.c:26:20: error: unistd.h: Ingen sådan fil eller filkatalog
loadndisdriver.c:27:19: error: fcntl.h: Ingen sådan fil eller filkatalog
I filen inkluderet af /usr/lib/gcc/i486-linux-gnu/4.0.3/include/syslimits.h:7,
af /usr/lib/gcc/i486-linux-gnu/4.0.3/include/limits.h:11,
af loadndisdriver.c:28:
/usr/lib/gcc/i486-linux-gnu/4.0.3/include/limits.h:122:61: error: limits.h: Ingen sådan fil eller filkatalog
loadndisdriver.c:29:19: error: ctype.h: Ingen sådan fil eller filkatalog
loadndisdriver.c:30:20: error: dirent.h: Ingen sådan fil eller filkatalog
loadndisdriver.c:31:20: error: syslog.h: Ingen sådan fil eller filkatalog
loadndisdriver.c:34:25: error: linux/major.h: Ingen sådan fil eller filkatalog
loadndisdriver.c:35:25: error: linux/ioctl.h: Ingen sådan fil eller filkatalog
In file included from loadndisdriver.c:37:
../driver/loader.h:24: fejl: syntax error before size_t
../driver/loader.h:24: advarsel: intet semikolon i slutningen af struct eller union
../driver/loader.h:26: fejl: syntax error before } token
../driver/loader.h:52: fejl: tabeltypen er af en ufuldstændig type
../driver/loader.h:56: fejl: tabeltypen er af en ufuldstændig type
loadndisdriver.c: In function load_file:
loadndisdriver.c:67: fejl: size_t undeclared (first use in this function)
loadndisdriver.c:67: fejl: (et kaldenavn der ikke er erklæret, rapporteres kun én gang
loadndisdriver.c:67: fejl: per funktion)
loadndisdriver.c:67: fejl: syntax error before size
loadndisdriver.c:68: fejl: NULL undeclared (first use in this function)
loadndisdriver.c:69: fejl: storage size of statbuf isnt known
loadndisdriver.c:71: advarsel: implicit declaration of function basename
loadndisdriver.c:71: advarsel: initialization makes pointer from integer without a cast
loadndisdriver.c:73: advarsel: implicit declaration of function open
loadndisdriver.c:73: fejl: O_RDONLY undeclared (first use in this function)
loadndisdriver.c:75: advarsel: implicit declaration of function syslog
loadndisdriver.c:75: fejl: LOG_KERN undeclared (first use in this function)
loadndisdriver.c:75: fejl: LOG_INFO undeclared (first use in this function)
loadndisdriver.c:75: advarsel: implicit declaration of function strerror
loadndisdriver.c:75: fejl: errno undeclared (first use in this function)
loadndisdriver.c:76: fejl: EINVAL undeclared (first use in this function)
loadndisdriver.c:79: advarsel: implicit declaration of function fstat
loadndisdriver.c:81: advarsel: implicit declaration of function close
loadndisdriver.c:84: fejl: size undeclared (first use in this function)
loadndisdriver.c:86: advarsel: implicit declaration of function mmap
loadndisdriver.c:86: fejl: PROT_READ undeclared (first use in this function)
loadndisdriver.c:86: fejl: MAP_PRIVATE undeclared (first use in this function)loadndisdriver.c:86: advarsel: assignment makes pointer from integer without a cast
loadndisdriver.c:87: fejl: MAP_FAILED undeclared (first use in this function)
loadndisdriver.c:93: advarsel: implicit declaration of function strncpy
loadndisdriver.c:93: advarsel: incompatible implicit declaration of built-in function strncpy
loadndisdriver.c:93: fejl: forsøg på at følge en henvisning til en variabel af en ufuldstændig type
loadndisdriver.c:93: fejl: forsøg på at følge en henvisning til en variabel af en ufuldstændig type
loadndisdriver.c:94: fejl: forsøg på at følge en henvisning til en variabel af en ufuldstændig type
loadndisdriver.c:94: fejl: forsøg på at følge en henvisning til en variabel af en ufuldstændig type
loadndisdriver.c:95: fejl: forsøg på at følge en henvisning til en variabel af en ufuldstændig type
loadndisdriver.c:96: fejl: forsøg på at følge en henvisning til en variabel af en ufuldstændig type
loadndisdriver.c:69: advarsel: unused variable statbuf
loadndisdriver.c: In function parse_setting_line:
loadndisdriver.c:109: advarsel: implicit declaration of function isspace
loadndisdriver.c:115: advarsel: implicit declaration of function strchr
loadndisdriver.c:115: advarsel: incompatible implicit declaration of built-in function strchr
loadndisdriver.c:115: fejl: NULL undeclared (first use in this function)
loadndisdriver.c:117: fejl: LOG_KERN undeclared (first use in this function)
loadndisdriver.c:117: fejl: LOG_INFO undeclared (first use in this function)
loadndisdriver.c:118: fejl: EINVAL undeclared (first use in this function)
loadndisdriver.c:138: advarsel: implicit declaration of function strlen
loadndisdriver.c:138: advarsel: incompatible implicit declaration of built-in function strlen
loadndisdriver.c: In function read_conf_file:
loadndisdriver.c:150: fejl: storage size of statbuf isnt known
loadndisdriver.c:151: fejl: FILE undeclared (first use in this function)
loadndisdriver.c:151: fejl: config undeclared (first use in this function)
loadndisdriver.c:157: advarsel: implicit declaration of function lstat
loadndisdriver.c:158: fejl: LOG_KERN undeclared (first use in this function)
loadndisdriver.c:158: fejl: LOG_INFO undeclared (first use in this function)
loadndisdriver.c:158: fejl: errno undeclared (first use in this function)
loadndisdriver.c:159: fejl: EINVAL undeclared (first use in this function)
loadndisdriver.c:162: advarsel: implicit declaration of function sscanf
loadndisdriver.c:162: advarsel: incompatible implicit declaration of built-in function sscanf
loadndisdriver.c:178: advarsel: implicit declaration of function fopen
loadndisdriver.c:178: fejl: NULL undeclared (first use in this function)
loadndisdriver.c:182: advarsel: implicit declaration of function fgets
loadndisdriver.c:194: advarsel: incompatible implicit declaration of built-in function strncpy
loadndisdriver.c:205: advarsel: implicit declaration of function fclose
loadndisdriver.c:150: advarsel: unused variable statbuf
loadndisdriver.c: In function load_bin_file:
loadndisdriver.c:214: fejl: storage size of driver_file isnt known
loadndisdriver.c:218: fejl: LOG_KERN undeclared (first use in this function)
loadndisdriver.c:218: fejl: LOG_INFO undeclared (first use in this function)
loadndisdriver.c:220: advarsel: implicit declaration of function tolower
loadndisdriver.c:222: advarsel: implicit declaration of function chdir
loadndisdriver.c:223: fejl: errno undeclared (first use in this function)
loadndisdriver.c:225: fejl: EINVAL undeclared (first use in this function)
loadndisdriver.c:231: advarsel: incompatible implicit declaration of built-in function strncpy
loadndisdriver.c:233: advarsel: implicit declaration of function ioctl
loadndisdriver.c:233: advarsel: implicit declaration of function _IOW
loadndisdriver.c:233: fejl: syntax error before struct
loadndisdriver.c:214: advarsel: unused variable driver_file
loadndisdriver.c:236: advarsel: control reaches end of non-void function
loadndisdriver.c: Ved øverste niveau:
loadndisdriver.c:237: fejl: syntax error before return
loadndisdriver.c: In function load_driver:
loadndisdriver.c:251: fejl: DIR undeclared (first use in this function)
loadndisdriver.c:251: fejl: driver_dir undeclared (first use in this function)loadndisdriver.c:253: fejl: NULL undeclared (first use in this function)
loadndisdriver.c:257: fejl: LOG_KERN undeclared (first use in this function)
loadndisdriver.c:257: fejl: LOG_INFO undeclared (first use in this function)
loadndisdriver.c:259: fejl: errno undeclared (first use in this function)
loadndisdriver.c:261: fejl: EINVAL undeclared (first use in this function)
loadndisdriver.c:263: advarsel: implicit declaration of function opendir
loadndisdriver.c:269: advarsel: implicit declaration of function malloc
loadndisdriver.c:269: advarsel: incompatible implicit declaration of built-in function malloc
loadndisdriver.c:273: advarsel: implicit declaration of function memset
loadndisdriver.c:273: advarsel: incompatible implicit declaration of built-in function memset
loadndisdriver.c:274: advarsel: incompatible implicit declaration of built-in function strncpy
loadndisdriver.c:282: advarsel: implicit declaration of function readdir
loadndisdriver.c:282: advarsel: assignment makes pointer from integer without a cast
loadndisdriver.c:284: fejl: storage size of statbuf isnt known
loadndisdriver.c:286: advarsel: implicit declaration of function strcmp
loadndisdriver.c:286: fejl: forsøg på at følge en henvisning til en variabel af en ufuldstændig type
loadndisdriver.c:287: fejl: forsøg på at følge en henvisning til en variabel af en ufuldstændig type
loadndisdriver.c:290: advarsel: implicit declaration of function stat
loadndisdriver.c:290: fejl: forsøg på at følge en henvisning til en variabel af en ufuldstændig type
loadndisdriver.c:291: advarsel: implicit declaration of function S_ISREG
loadndisdriver.c:292: fejl: forsøg på at følge en henvisning til en variabel af en ufuldstændig type
loadndisdriver.c:297: advarsel: incompatible implicit declaration of built-in function strlen
loadndisdriver.c:297: fejl: forsøg på at følge en henvisning til en variabel af en ufuldstændig type
loadndisdriver.c:299: fejl: forsøg på at følge en henvisning til en variabel af en ufuldstændig type
loadndisdriver.c:302: fejl: forsøg på at følge en henvisning til en variabel af en ufuldstændig type
loadndisdriver.c:305: fejl: forsøg på at følge en henvisning til en variabel af en ufuldstændig type
loadndisdriver.c:306: fejl: forsøg på at følge en henvisning til en variabel af en ufuldstændig type
loadndisdriver.c:308: fejl: forsøg på at følge en henvisning til en variabel af en ufuldstændig type
loadndisdriver.c:314: fejl: forsøg på at følge en henvisning til en variabel af en ufuldstændig type
loadndisdriver.c:315: fejl: forsøg på at følge en henvisning til en variabel af en ufuldstændig type
loadndisdriver.c:316: advarsel: implicit declaration of function strcpy
loadndisdriver.c:316: advarsel: incompatible implicit declaration of built-in function strcpy
loadndisdriver.c:317: fejl: forsøg på at følge en henvisning til en variabel af en ufuldstændig type
loadndisdriver.c:324: fejl: forsøg på at følge en henvisning til en variabel af en ufuldstændig type
loadndisdriver.c:284: advarsel: unused variable statbuf
loadndisdriver.c:347: fejl: syntax error before struct
loadndisdriver.c:349: advarsel: implicit declaration of function closedir
loadndisdriver.c:351: advarsel: implicit declaration of function free
loadndisdriver.c:358: advarsel: implicit declaration of function munmap
loadndisdriver.c:364: advarsel: control reaches end of non-void function
loadndisdriver.c: Ved øverste niveau:
loadndisdriver.c:383: fejl: syntax error before * token
loadndisdriver.c: In function add_driver_devices:
loadndisdriver.c:389: fejl: from undeclared (first use in this function)
loadndisdriver.c:390: fejl: dir undeclared (first use in this function)
loadndisdriver.c:390: fejl: driver_name undeclared (first use in this function)
loadndisdriver.c:391: fejl: LOG_KERN undeclared (first use in this function)
loadndisdriver.c:391: fejl: LOG_INFO undeclared (first use in this function)
loadndisdriver.c:396: advarsel: assignment makes pointer from integer without a cast
loadndisdriver.c:405: fejl: forsøg på at følge en henvisning til en variabel af en ufuldstændig type
loadndisdriver.c:406: fejl: forsøg på at følge en henvisning til en variabel af en ufuldstændig type
loadndisdriver.c:409: advarsel: incompatible implicit declaration of built-in function strlen
loadndisdriver.c:409: fejl: forsøg på at følge en henvisning til en variabel af en ufuldstændig type
loadndisdriver.c:410: fejl: forsøg på at følge en henvisning til en variabel af en ufuldstændig type
loadndisdriver.c:411: fejl: storage size of statbuf isnt known
loadndisdriver.c:415: fejl: forsøg på at følge en henvisning til en variabel af en ufuldstændig type
loadndisdriver.c:416: fejl: errno undeclared (first use in this function)
loadndisdriver.c:421: fejl: forsøg på at følge en henvisning til en variabel af en ufuldstændig type
loadndisdriver.c:421: advarsel: assignment makes pointer from integer without a cast
loadndisdriver.c:425: fejl: devices undeclared (first use in this function)
loadndisdriver.c:427: advarsel: incompatible implicit declaration of built-in function sscanf
loadndisdriver.c:440: fejl: forsøg på at følge en henvisning til en variabel af en ufuldstændig type
loadndisdriver.c:448: advarsel: incompatible implicit declaration of built-in function strncpy
loadndisdriver.c:450: fejl: forsøg på at følge en henvisning til en variabel af en ufuldstændig type
loadndisdriver.c:452: advarsel: implicit declaration of function strncat
loadndisdriver.c:452: advarsel: incompatible implicit declaration of built-in function strncat
loadndisdriver.c:411: advarsel: unused variable statbuf
loadndisdriver.c: In function load_all_devices:
loadndisdriver.c:472: fejl: storage size of statbuf isnt known
loadndisdriver.c:474: fejl: DIR undeclared (first use in this function)
loadndisdriver.c:474: fejl: dir undeclared (first use in this function)
loadndisdriver.c:474: fejl: driver undeclared (first use in this function)
loadndisdriver.c:474: advarsel: venstreoperanden til kommaudtrykket har ingen virkning
loadndisdriver.c:474: advarsel: sætning uden nogen virkning
loadndisdriver.c:480: fejl: LOG_KERN undeclared (first use in this function)
loadndisdriver.c:480: fejl: LOG_INFO undeclared (first use in this function)
loadndisdriver.c:480: fejl: errno undeclared (first use in this function)
loadndisdriver.c:482: fejl: EINVAL undeclared (first use in this function)
loadndisdriver.c:484: fejl: NULL undeclared (first use in this function)
loadndisdriver.c:490: advarsel: incompatible implicit declaration of built-in function malloc
loadndisdriver.c:496: advarsel: assignment makes pointer from integer without a cast
loadndisdriver.c:497: fejl: forsøg på at følge en henvisning til en variabel af en ufuldstændig type
loadndisdriver.c:498: fejl: forsøg på at følge en henvisning til en variabel af en ufuldstændig type
loadndisdriver.c:501: fejl: forsøg på at følge en henvisning til en variabel af en ufuldstændig type
loadndisdriver.c:502: advarsel: implicit declaration of function S_ISDIR
loadndisdriver.c:504: fejl: forsøg på at følge en henvisning til en variabel af en ufuldstændig type
loadndisdriver.c:505: fejl: forsøg på at følge en henvisning til en variabel af en ufuldstændig type
loadndisdriver.c:509: fejl: forsøg på at følge en henvisning til en variabel af en ufuldstændig type
loadndisdriver.c:510: fejl: forsøg på at følge en henvisning til en variabel af en ufuldstændig type
loadndisdriver.c:515: fejl: forsøg på at følge en henvisning til en variabel af en ufuldstændig type
loadndisdriver.c:531: fejl: syntax error before struct
loadndisdriver.c:472: advarsel: unused variable statbuf
loadndisdriver.c: In function get_ioctl_device:
loadndisdriver.c:552: fejl: FILE undeclared (first use in this function)
loadndisdriver.c:552: fejl: proc_misc undeclared (first use in this function)
loadndisdriver.c:560: advarsel: implicit declaration of function strstr
loadndisdriver.c:560: advarsel: incompatible implicit declaration of built-in function strstr
loadndisdriver.c:561: advarsel: implicit declaration of function strtol
loadndisdriver.c:561: fejl: NULL undeclared (first use in this function)
loadndisdriver.c:571: fejl: LOG_KERN undeclared (first use in this function)
loadndisdriver.c:571: fejl: LOG_INFO undeclared (first use in this function)
loadndisdriver.c:576: advarsel: implicit declaration of function unlink
loadndisdriver.c:577: advarsel: implicit declaration of function mknod
loadndisdriver.c:577: fejl: S_IFCHR undeclared (first use in this function)
loadndisdriver.c:577: fejl: MISC_MAJOR undeclared (first use in this function)loadndisdriver.c:579: fejl: errno undeclared (first use in this function)
loadndisdriver.c:584: fejl: O_RDONLY undeclared (first use in this function)
loadndisdriver.c: In function main:
loadndisdriver.c:605: advarsel: implicit declaration of function openlog
loadndisdriver.c:605: fejl: LOG_PERROR undeclared (first use in this function)loadndisdriver.c:605: fejl: LOG_CONS undeclared (first use in this function)
loadndisdriver.c:605: fejl: LOG_KERN undeclared (first use in this function)
loadndisdriver.c:605: fejl: LOG_DEBUG undeclared (first use in this function)
loadndisdriver.c:607: fejl: LOG_INFO undeclared (first use in this function)
loadndisdriver.c:609: advarsel: implicit declaration of function strncmp
loadndisdriver.c:611: advarsel: implicit declaration of function printf
loadndisdriver.c:611: advarsel: incompatible implicit declaration of built-in function printf
loadndisdriver.c:621: advarsel: implicit declaration of function atoi
loadndisdriver.c:636: advarsel: implicit declaration of function atof
loadndisdriver.c:668: advarsel: implicit declaration of function closelog
make[1]: *** [loadndisdriver] Fejl 1
make[1]: Forlader katalog '/home/dapet/ndiswrapper-1.21/utils'
make: *** [all] Fejl 2
dapet@DanielsCom:~/ndiswrapper-1.21$