All pastes #10640 Raw Edit

Miscellany

public text v1 · immutable
#10640 ·published 2005-04-30 10:11 UTC
rendered paste body
NOTE: package mb-desktop-xine-0.4: started
NOTE: package mb-desktop-xine-0.4-r0: task do_fetch: started
NOTE: package mb-desktop-xine-0.4-r0: task do_fetch: completed
NOTE: package mb-desktop-xine-0.4-r0: task do_configure: started
NOTE: package mb-desktop-xine-0.4-r0: task do_configure: completed
NOTE: package mb-desktop-xine-0.4-r0: task do_compile: started
ERROR: function do_compile failed
ERROR: log data follows (/home/enpsgp/dev/build/tmp/work/mb-desktop-xine-0.4-r0/temp/log.do_compile.25356)
| NOTE: make
| cd /home/enpsgp/dev/build/tmp/work/mb-desktop-xine-0.4-r0/mb-desktop-xine-0.4 && /bin/sh /home/enpsgp/dev/build/tmp/work/mb-desktop-xine-0.4-r0/mb-desktop-xine-0.4/missing --run autoheader
| rm -f stamp-h1
| touch /home/enpsgp/dev/build/tmp/work/mb-desktop-xine-0.4-r0/mb-desktop-xine-0.4/config.h.in
| cd . && /bin/sh ./config.status config.h
| config.status: creating config.h
| config.status: config.h is unchanged
| make  all-recursive
| make[1]: Entering directory `/home/enpsgp/dev/build/tmp/work/mb-desktop-xine-0.4-r0/mb-desktop-xine-0.4'
| Making all in theme
| make[2]: Entering directory `/home/enpsgp/dev/build/tmp/work/mb-desktop-xine-0.4-r0/mb-desktop-xine-0.4/theme'
| make[2]: Nothing to be done for `all'.
| make[2]: Leaving directory `/home/enpsgp/dev/build/tmp/work/mb-desktop-xine-0.4-r0/mb-desktop-xine-0.4/theme'
| make[2]: Entering directory `/home/enpsgp/dev/build/tmp/work/mb-desktop-xine-0.4-r0/mb-desktop-xine-0.4'
| if /bin/sh ./arm-linux-libtool --tag=CC --mode=compile ccache arm-linux-gcc -march=armv5te -mtune=xscale -DHAVE_CONFIG_H -I. -I/home/enpsgp/dev/build/tmp/work/mb-desktop-xine-0.4-r0/mb-desktop-xine-0.4 -I. -D_XOPEN_SOURCE=500 -I/home/enpsgp/dev/build/tmp/staging/arm-linux/include -I/home/enpsgp/dev/build/tmp/staging/arm-linux/include/pango-1.0 -I/home/enpsgp/dev/build/tmp/staging/arm-linux/include/glib-2.0 -I/home/enpsgp/dev/build/tmp/staging/arm-linux/lib/glib-2.0/include -I/home/enpsgp/dev/build/tmp/staging/arm-linux/include/freetype2 -I/home/enpsgp/dev/build/tmp/staging/arm-linux/lib/../include/libpng12 -I/home/enpsgp/dev/build/tmp/staging/arm-linux/include/matchbox-desktop   -I/home/enpsgp/dev/build/tmp/staging/arm-linux/include -g -DDATADIR=\"/usr/share\"  -I/home/enpsgp/dev/build/tmp/staging/arm-linux/include  -I/home/enpsgp/dev/build/tmp/staging/arm-linux/include -fexpensive-optimizations -fomit-frame-pointer -frename-registers -O2 -MT xinebrowser.lo -MD -MP -MF ".deps/xinebrowser.Tpo" -c -o xinebrowser.lo xinebrowser.c; \
| then mv -f ".deps/xinebrowser.Tpo" ".deps/xinebrowser.Plo"; else rm -f ".deps/xinebrowser.Tpo"; exit 1; fi
| mkdir .libs
|  ccache arm-linux-gcc -march=armv5te -mtune=xscale -DHAVE_CONFIG_H -I. -I/home/enpsgp/dev/build/tmp/work/mb-desktop-xine-0.4-r0/mb-desktop-xine-0.4 -I. -D_XOPEN_SOURCE=500 -I/home/enpsgp/dev/build/tmp/staging/arm-linux/include -I/home/enpsgp/dev/build/tmp/staging/arm-linux/include/pango-1.0 -I/home/enpsgp/dev/build/tmp/staging/arm-linux/include/glib-2.0 -I/home/enpsgp/dev/build/tmp/staging/arm-linux/lib/glib-2.0/include -I/home/enpsgp/dev/build/tmp/staging/arm-linux/include/freetype2 -I/home/enpsgp/dev/build/tmp/staging/arm-linux/lib/../include/libpng12 -I/home/enpsgp/dev/build/tmp/staging/arm-linux/include/matchbox-desktop -I/home/enpsgp/dev/build/tmp/staging/arm-linux/include -g -DDATADIR=\"/usr/share\" -I/home/enpsgp/dev/build/tmp/staging/arm-linux/include -I/home/enpsgp/dev/build/tmp/staging/arm-linux/include -fexpensive-optimizations -fomit-frame-pointer -frename-registers -O2 -MT xinebrowser.lo -MD -MP -MF .deps/xinebrowser.Tpo -c xinebrowser.c  -fPIC -DPIC -o .libs/xinebrowser.o
| In file included from xinebrowser.c:17:
| xinebrowser.h:23:30: mbdesktop_module.h: No such file or directory
| In file included from /home/enpsgp/dev/build/tmp/staging/arm-linux/include/xine/xineutils.h:31,
|                  from xinebrowser.h:26,
|                  from xinebrowser.c:17:
| ./config.h:24:1: warning: "HAVE_STDLIB_H" redefined
| In file included from /home/enpsgp/dev/build/tmp/staging/arm-linux/include/jpeglib.h:24,
|                  from /home/enpsgp/dev/build/tmp/staging/arm-linux/include/libmb/mbpixbuf.h:48,
|                  from /home/enpsgp/dev/build/tmp/staging/arm-linux/include/libmb/mb.h:27,
|                  from xinebrowser.h:22,
|                  from xinebrowser.c:17:
| /home/enpsgp/dev/build/tmp/staging/arm-linux/include/jconfig.h:12:1: warning: this is the location of the previous definition
| In file included from xinebrowser.h:26,
|                  from xinebrowser.c:17:
| /home/enpsgp/dev/build/tmp/staging/arm-linux/include/xine/xineutils.h:1042: warning: "struct timezone" declared inside parameter list
| /home/enpsgp/dev/build/tmp/staging/arm-linux/include/xine/xineutils.h:1042: warning: its scope is only this definition or declaration, which is probably not what you want
| In file included from xinebrowser.c:17:
| xinebrowser.h:109: error: syntax error before "MBDesktopItem"
| xinebrowser.h:109: warning: no semicolon at end of struct or union
| xinebrowser.h:124: error: syntax error before '*' token
| xinebrowser.h:124: warning: data definition has no type or storage class
| xinebrowser.h:141: error: syntax error before '}' token
| xinebrowser.h:141: warning: data definition has no type or storage class
| xinebrowser.h:144: error: syntax error before '*' token
| xinebrowser.h:147: error: syntax error before '*' token
| xinebrowser.h:150: error: syntax error before '*' token
| xinebrowser.h:153: error: syntax error before '*' token
| xinebrowser.h:158: error: syntax error before '*' token
| xinebrowser.h:163: error: syntax error before '*' token
| xinebrowser.c: In function `dest_size_cb':
| xinebrowser.c:26: error: `data' undeclared (first use in this function)
| xinebrowser.c:26: error: (Each undeclared identifier is reported only once
| xinebrowser.c:26: error: for each function it appears in.)
| xinebrowser.c:26: error: syntax error before ')' token
| xinebrowser.c: In function `frame_output_cb':
| xinebrowser.c:39: error: `data' undeclared (first use in this function)
| xinebrowser.c:39: error: syntax error before ')' token
| xinebrowser.c: In function `event_listener':
| xinebrowser.c:66: error: `data' undeclared (first use in this function)
| xinebrowser.c:66: error: syntax error before ')' token
| xinebrowser.c: At top level:
| xinebrowser.c:108: error: syntax error before '*' token
| xinebrowser.c:109: error: syntax error before '*' token
| xinebrowser.c: In function `xinebrowser_get_prev_item':
| xinebrowser.c:113: error: `MBDesktopItem' undeclared (first use in this function)
| xinebrowser.c:113: error: `item' undeclared (first use in this function)
| xinebrowser.c:115: error: `item_sibling' undeclared (first use in this function)
| xinebrowser.c:124: error: `data' undeclared (first use in this function)
| xinebrowser.c: At top level:
| xinebrowser.c:131: error: syntax error before '*' token
| xinebrowser.c:132: error: syntax error before '*' token
| xinebrowser.c: In function `xinebrowser_get_next_item':
| xinebrowser.c:136: error: `MBDesktopItem' undeclared (first use in this function)
| xinebrowser.c:136: error: `item' undeclared (first use in this function)
| xinebrowser.c:138: error: `item_sibling' undeclared (first use in this function)
| xinebrowser.c:145: error: `data' undeclared (first use in this function)
| xinebrowser.c: At top level:
| xinebrowser.c:151: error: syntax error before '*' token
| xinebrowser.c:152: error: syntax error before '*' token
| xinebrowser.c:169: error: syntax error before '*' token
| xinebrowser.c: In function `xinebrowser_dvd_send_event':
| xinebrowser.c:175: error: `event_id' undeclared (first use in this function)
| xinebrowser.c:177: error: `data' undeclared (first use in this function)
| xinebrowser.c: At top level:
| xinebrowser.c:186: error: syntax error before '*' token
| xinebrowser.c: In function `xinebrowser_win_open':
| xinebrowser.c:188: error: `data' undeclared (first use in this function)
| xinebrowser.c:197: error: `force_shm' undeclared (first use in this function)
| xinebrowser.c: At top level:
| xinebrowser.c:312: error: syntax error before '*' token
| xinebrowser.c: In function `xinebrowser_win_close':
| xinebrowser.c:315: error: `data' undeclared (first use in this function)
| xinebrowser.c: At top level:
| xinebrowser.c:346: error: syntax error before '*' token
| xinebrowser.c: In function `xinebrowser_volume_change':
| xinebrowser.c:350: error: `data' undeclared (first use in this function)
| xinebrowser.c:352: error: `action' undeclared (first use in this function)
| xinebrowser.c: At top level:
| xinebrowser.c:406: error: syntax error before '*' token
| xinebrowser.c: In function `xinebrowser_win_event_loop':
| xinebrowser.c:408: error: `data' undeclared (first use in this function)
| xinebrowser.c: At top level:
| xinebrowser.c:702: error: syntax error before '*' token
| xinebrowser.c: In function `clip_osd':
| xinebrowser.c:708: error: `text_to_clip' undeclared (first use in this function)
| xinebrowser.c:719: error: `data' undeclared (first use in this function)
| xinebrowser.c:720: error: `max_width' undeclared (first use in this function)
| xinebrowser.c: At top level:
| xinebrowser.c:727: error: syntax error before '*' token
| xinebrowser.c: In function `xinebrowser_show_info':
| xinebrowser.c:740: error: `data' undeclared (first use in this function)
| xinebrowser.c:783: error: `info_flags' undeclared (first use in this function)
| xinebrowser.c: At top level:
| xinebrowser.c:825: error: syntax error before '*' token
| xinebrowser.c: In function `xinebrowser_play':
| xinebrowser.c:829: error: `mrl' undeclared (first use in this function)
| xinebrowser.c:845: error: `data' undeclared (first use in this function)
| xinebrowser.c: At top level:
| xinebrowser.c:856: error: syntax error before '*' token
| xinebrowser.c: In function `xinebrowser_make_thumbnail':
| xinebrowser.c:868: error: `data' undeclared (first use in this function)
| xinebrowser.c:868: error: `mrl' undeclared (first use in this function)
| xinebrowser.c:951: error: request for member `pixbuf' in something not a structure or union
| xinebrowser.c:970: error: request for member `pixbuf' in something not a structure or union
| xinebrowser.c:973: error: request for member `pixbuf' in something not a structure or union
| xinebrowser.c:977: error: request for member `pixbuf' in something not a structure or union
| xinebrowser.c:983: error: request for member `pixbuf' in something not a structure or union
| xinebrowser.c:984: error: request for member `pixbuf' in something not a structure or union
| xinebrowser.c: At top level:
| xinebrowser.c:997: error: syntax error before '*' token
| xinebrowser.c: In function `xinebrowser_init':
| xinebrowser.c:1004: error: `MBDesktopItem' undeclared (first use in this function)
| xinebrowser.c:1004: error: `folder' undeclared (first use in this function)
| xinebrowser.c:1005: error: `data' undeclared (first use in this function)
| xinebrowser.c:1027: error: `arg_str' undeclared (first use in this function)
| xinebrowser.c:1118: error: `VIEW_LIST' undeclared (first use in this function)
| xinebrowser.c:1143: error: `subitem' undeclared (first use in this function)
| xinebrowser.c:1264: error: `item_new' undeclared (first use in this function)
| xinebrowser.c:1271: error: `ITEM_TYPE_MODULE_ITEM' undeclared (first use in this function)
| xinebrowser.c: At top level:
| xinebrowser.c:1338: error: syntax error before "xinebrowser_info"
| xinebrowser.c:1340: warning: initialization makes integer from pointer without a cast
| xinebrowser.c:1341: warning: excess elements in scalar initializer
| xinebrowser.c:1341: warning: (near initialization for `xinebrowser_info')
| xinebrowser.c:1342: warning: excess elements in scalar initializer
| xinebrowser.c:1342: warning: (near initialization for `xinebrowser_info')
| xinebrowser.c:1343: warning: excess elements in scalar initializer
| xinebrowser.c:1343: warning: (near initialization for `xinebrowser_info')
| xinebrowser.c:1344: warning: excess elements in scalar initializer
| xinebrowser.c:1344: warning: (near initialization for `xinebrowser_info')
| xinebrowser.c:1345: warning: excess elements in scalar initializer
| xinebrowser.c:1345: warning: (near initialization for `xinebrowser_info')
| xinebrowser.c:1347: warning: excess elements in scalar initializer
| xinebrowser.c:1347: warning: (near initialization for `xinebrowser_info')
| xinebrowser.c:1347: warning: data definition has no type or storage class
| xinebrowser.c:1349: error: syntax error before "folder_module"
| xinebrowser.c:1351: warning: initialization makes integer from pointer without a cast
| xinebrowser.c:1352: warning: excess elements in scalar initializer
| xinebrowser.c:1352: warning: (near initialization for `folder_module')
| xinebrowser.c:1353: warning: excess elements in scalar initializer
| xinebrowser.c:1353: warning: (near initialization for `folder_module')
| xinebrowser.c:1355: warning: excess elements in scalar initializer
| xinebrowser.c:1355: warning: (near initialization for `folder_module')
| xinebrowser.c:1355: warning: data definition has no type or storage class
| make[2]: *** [xinebrowser.lo] Error 1
| make[2]: Leaving directory `/home/enpsgp/dev/build/tmp/work/mb-desktop-xine-0.4-r0/mb-desktop-xine-0.4'
| make[1]: *** [all-recursive] Error 1
| make[1]: Leaving directory `/home/enpsgp/dev/build/tmp/work/mb-desktop-xine-0.4-r0/mb-desktop-xine-0.4'
| make: *** [all] Error 2
| FATAL: oe_runmake failed
NOTE: Task failed: 
NOTE: package mb-desktop-xine-0.4-r0: task do_compile: failed
ERROR: TaskFailed event exception, aborting
NOTE: package mb-desktop-xine-0.4: failed
ERROR: Build of mb-desktop-xine failed