the following environment is being used:
ACLOCALFLAGS:
CFLAGS: -Os -fPIC
CPPFLAGS: -I/sw/lib/system-openssl/include -I/sw/lib/freetype219/include/freetype2 -I/sw/lib/freetype219/include -I/sw/lib/flex/include -fno-common -no-cpp-precomp -DMACOSX -DARTS_NO_ALARM -I/sw/include -I/usr/X11R6/include
CXXFLAGS: -Os -fPIC
FREETYPE_CONFIG: /sw/lib/freetype219/bin/freetype-config
LDFLAGS: -L/sw/lib/flex/lib -L/sw/lib/freetype219/lib -L/sw/lib/system-openssl/lib
LIBS: -L/sw/lib -L/usr/X11R6/lib
MACOSX_DEPLOYMENT_TARGET: 10.4
PATH: /sw/lib/flex/bin:/sw/lib/freetype219/bin:/sw/lib/system-openssl/bin:/sw/var/lib/fink/path-prefix-g++-4.0:/sw/bin:/sw/sbin:/bin:/usr/bin:/sbin:/usr/sbin:/usr/X11R6/bin:/usr/X11R6/bin
PKG_CONFIG_PATH: /sw/lib/flex/lib/pkgconfig
*** YOU'RE USING autoconf (GNU Autoconf) 2.60.
*** KDE requires autoconf 2.53 or newer
make: *** [cvs] Error 1
checking build system type... i686-apple-darwin8.7.1
checking host system type... i686-apple-darwin8.7.1
checking target system type... i686-apple-darwin8.7.1
checking for a BSD-compatible install... /usr/bin/install -c
checking for -p flag to install... yes
checking whether build environment is sane... yes
checking for gawk... no
checking for mawk... no
checking for nawk... no
checking for awk... awk
checking whether make sets $(MAKE)... yes
checking for style of include used by make... GNU
checking for gcc... gcc
checking for C compiler default output file name... a.out
checking whether the C compiler works... yes
checking whether we are cross compiling... no
checking for suffix of executables...
checking for suffix of object files... o
checking whether we are using the GNU C compiler... yes
checking whether gcc accepts -g... yes
checking for gcc option to accept ANSI C... none needed
checking dependency style of gcc... gcc3
checking how to run the C preprocessor... gcc -E
checking whether we are using the GNU C++ compiler... yes
checking whether g++ accepts -g... yes
checking dependency style of g++... gcc3
checking whether gcc is blacklisted... no
checking whether g++ supports -Wundef... yes
checking whether g++ supports -Wno-long-long... yes
checking whether g++ supports -Wnon-virtual-dtor... yes
checking whether g++ supports -fno-exceptions... yes
checking whether g++ supports -fno-check-new... yes
checking whether g++ supports -fno-common... yes
checking whether g++ supports -fexceptions... yes
checking how to run the C++ preprocessor... g++ -E
checking whether g++ supports -O0... yes
not using lib directory suffix
checking for a sed that does not truncate output... /usr/bin/sed
checking for egrep... grep -E
checking for ld used by gcc... /usr/bin/ld
checking if the linker (/usr/bin/ld) is GNU ld... no
checking for /usr/bin/ld option to reload object files... -r
checking for BSD-compatible nm... /usr/bin/nm -p
checking whether ln -s works... yes
checking how to recognise dependent libraries... pass_all
checking for ANSI C header files... yes
checking for sys/types.h... yes
checking for sys/stat.h... yes
checking for stdlib.h... yes
checking for string.h... yes
checking for memory.h... yes
checking for strings.h... yes
checking for inttypes.h... yes
checking for stdint.h... yes
checking for unistd.h... yes
checking dlfcn.h usability... yes
checking dlfcn.h presence... yes
checking for dlfcn.h... yes
checking for g77... no
checking for f77... no
checking for xlf... no
checking for frt... no
checking for pgf77... no
checking for fort77... no
checking for fl32... no
checking for af77... no
checking for f90... no
checking for xlf90... no
checking for pgf90... no
checking for epcf90... no
checking for f95... no
checking for fort... no
checking for xlf95... no
checking for ifc... no
checking for efc... no
checking for pgf95... no
checking for lf95... no
checking for gfortran... no
checking whether we are using the GNU Fortran 77 compiler... no
checking whether accepts -g... no
checking the maximum length of command line arguments... (cached) 65536
checking command to parse /usr/bin/nm -p output from gcc object... ok
checking for objdir... .libs
checking for ar... ar
checking for ranlib... ranlib
checking for strip... strip
checking if gcc static flag works... yes
checking if gcc supports -fno-rtti -fno-exceptions... no
checking for gcc option to produce PIC... -fno-common
checking if gcc PIC flag -fno-common works... yes
checking if gcc supports -c -o file.o... yes
checking whether the gcc linker (/usr/bin/ld) supports shared libraries... yes
checking dynamic linker characteristics... darwin8.7.1 dyld
checking how to hardcode library paths into programs... immediate
checking whether stripping libraries is possible... yes
checking for dlopen in -ldl... yes
checking whether a program can dlopen itself... yes
checking whether a statically linked program can dlopen itself... yes
checking if libtool supports shared libraries... yes
checking whether to build shared libraries... yes
checking whether to build static libraries... no
configure: creating libtool
appending configuration tag "CXX" to libtool
checking for ld used by g++... /usr/bin/ld
checking if the linker (/usr/bin/ld) is GNU ld... no
checking whether the g++ linker (/usr/bin/ld) supports shared libraries... yes
checking for g++ option to produce PIC... -fno-common
checking if g++ PIC flag -fno-common works... yes
checking if g++ supports -c -o file.o... yes
checking whether the g++ linker (/usr/bin/ld) supports shared libraries... yes
checking dynamic linker characteristics... darwin8.7.1 dyld
checking how to hardcode library paths into programs... immediate
checking whether stripping libraries is possible... yes
checking for dlopen in -ldl... (cached) yes
checking whether a program can dlopen itself... (cached) yes
checking whether a statically linked program can dlopen itself... (cached) yes
appending configuration tag "F77" to libtool
checking zlib.h usability... yes
checking zlib.h presence... yes
checking for zlib.h... yes
checking if bindings should be compiled... yes
checking if examples should be compiled... yes
checking if taglib should be compiled... yes
checking if tests should be compiled... yes
configure: creating ./config.status
fast creating Makefile
fast creating bindings/Makefile
fast creating bindings/c/Makefile
fast creating examples/Makefile
fast creating taglib/Makefile
fast creating taglib/ape/Makefile
fast creating taglib/flac/Makefile
fast creating taglib/mpc/Makefile
fast creating taglib/mpeg/Makefile
fast creating taglib/mpeg/id3v1/Makefile
fast creating taglib/mpeg/id3v2/Makefile
fast creating taglib/mpeg/id3v2/frames/Makefile
fast creating taglib/ogg/Makefile
fast creating taglib/ogg/flac/Makefile
fast creating taglib/ogg/vorbis/Makefile
fast creating taglib/toolkit/Makefile
fast creating tests/Makefile
fast creating taglib/taglib-config
fast creating taglib/taglib.pc
config.pl: fast created 19 file(s).
config.status: creating config.h
config.status: executing depfiles commands
Good - your configure finished. Start make now
ERROR:Makefile: target '' marked PHONY but isn't present
ERROR:Makefile: target 'html-am' marked PHONY but isn't present
ERROR:Makefile: target 'install-info-am' marked PHONY but isn't present
ERROR:Makefile: target 'maintainer-clean-recursive' marked PHONY but isn't present
ERROR:Makefile: target 'all-recursive check-recursive dvi-recursive html-recursive info-recursive install-data-recursive install-exec-recursive install-info-recursive install-recursive installcheck-recursive installdirs-recursive pdf-recursive ps-recursive uninstall-info-recursive uninstall-recursive nmcheck-recursive bcheck-recursive' marked PHONY but isn't present
ERROR:Makefile: target 'html-am' marked PHONY but isn't present
ERROR:Makefile: target 'install-info-am' marked PHONY but isn't present
ERROR:Makefile: target 'maintainer-clean-recursive' marked PHONY but isn't present
ERROR:Makefile.am tries to overwrite the PHONY status of dist-hook:
['cd examples ; \x01\t/sw/share/unsermake/unsermake all']
['cd examples ; \x01\t$(MAKE) all']
Traceback (most recent call last):
File "<string>", line 1, in ?
File "/sw/share/unsermake/__init__.py", line 1362, in ?
main()
File "/sw/share/unsermake/__init__.py", line 1217, in main
top_makefile = setup_top_makefile( top_srcdir, subdir )
File "/sw/share/unsermake/__init__.py", line 791, in setup_top_makefile
top_makefile = merged_makefiles(".", top_srcdir + "/" + subdir)
File "/sw/share/unsermake/__init__.py", line 164, in merged_makefiles
dest.addTarget(targ)
File "/sw/share/unsermake/amfile.py", line 61, in addTarget
self.targets[target.target].merge(target)
File "/sw/share/unsermake/target.py", line 87, in merge
raise ("two targets named '%s' define rules!" % self.target)
two targets named 'examples-all' define rules!
/bin/rm -rf /sw/src/fink.build/root-taglib-1.4-1022
/bin/mkdir -p /sw/src/fink.build/root-taglib-1.4-1022/sw
/bin/mkdir -p /sw/src/fink.build/root-taglib-1.4-1022/DEBIAN
/usr/sbin/chown -R root:admin /sw/src/fink.build/root-taglib-1.4-1022
/var/tmp/tmp.2.iAvpXh
the following environment is being used:
ACLOCALFLAGS:
CFLAGS: -Os -fPIC
CPPFLAGS: -I/sw/lib/system-openssl/include -I/sw/lib/freetype219/include/freetype2 -I/sw/lib/freetype219/include -I/sw/lib/flex/include -fno-common -no-cpp-precomp -DMACOSX -DARTS_NO_ALARM -I/sw/include -I/usr/X11R6/include
CXXFLAGS: -Os -fPIC
FREETYPE_CONFIG: /sw/lib/freetype219/bin/freetype-config
LDFLAGS: -L/sw/lib/flex/lib -L/sw/lib/freetype219/lib -L/sw/lib/system-openssl/lib
LIBS: -L/sw/lib -L/usr/X11R6/lib
MACOSX_DEPLOYMENT_TARGET: 10.4
PATH: /sw/lib/flex/bin:/sw/lib/freetype219/bin:/sw/lib/system-openssl/bin:/sw/var/lib/fink/path-prefix-g++-4.0:/sw/bin:/sw/sbin:/bin:/usr/bin:/sbin:/usr/sbin:/usr/X11R6/bin:/usr/X11R6/bin
PKG_CONFIG_PATH: /sw/lib/flex/lib/pkgconfig
ERROR:Makefile: target '' marked PHONY but isn't present
ERROR:Makefile: target 'html-am' marked PHONY but isn't present
ERROR:Makefile: target 'install-info-am' marked PHONY but isn't present
ERROR:Makefile: target 'maintainer-clean-recursive' marked PHONY but isn't present
ERROR:Makefile: target 'all-recursive check-recursive dvi-recursive html-recursive info-recursive install-data-recursive install-exec-recursive install-info-recursive install-recursive installcheck-recursive installdirs-recursive pdf-recursive ps-recursive uninstall-info-recursive uninstall-recursive nmcheck-recursive bcheck-recursive' marked PHONY but isn't present
ERROR:Makefile: target 'html-am' marked PHONY but isn't present
ERROR:Makefile: target 'install-info-am' marked PHONY but isn't present
ERROR:Makefile: target 'maintainer-clean-recursive' marked PHONY but isn't present
ERROR:Makefile.am tries to overwrite the PHONY status of dist-hook:
['cd examples ; \x01\t/sw/share/unsermake/unsermake all']
['cd examples ; \x01\t$(MAKE) all']
Traceback (most recent call last):
File "<string>", line 1, in ?
File "/sw/share/unsermake/__init__.py", line 1362, in ?
main()
File "/sw/share/unsermake/__init__.py", line 1217, in main
top_makefile = setup_top_makefile( top_srcdir, subdir )
File "/sw/share/unsermake/__init__.py", line 791, in setup_top_makefile
top_makefile = merged_makefiles(".", top_srcdir + "/" + subdir)
File "/sw/share/unsermake/__init__.py", line 164, in merged_makefiles
dest.addTarget(targ)
File "/sw/share/unsermake/amfile.py", line 61, in addTarget
self.targets[target.target].merge(target)
File "/sw/share/unsermake/target.py", line 87, in merge
raise ("two targets named '%s' define rules!" % self.target)
two targets named 'examples-all' define rules!
/usr/bin/install -d -m 755 /sw/src/fink.build/root-taglib-1.4-1022/sw/share/doc/taglib
/usr/bin/install -c -p -m 644 AUTHORS COPYING* ChangeLog INSTALL README TODO /sw/src/fink.build/root-taglib-1.4-1022/sw/share/doc/taglib/
/bin/rm -f /sw/src/fink.build/root-taglib-1.4-1022/sw/info/dir /sw/src/fink.build/root-taglib-1.4-1022/sw/info/dir.old /sw/src/fink.build/root-taglib-1.4-1022/sw/share/info/dir /sw/src/fink.build/root-taglib-1.4-1022/sw/share/info/dir.old
/bin/rm -rf /sw/src/fink.build/root-taglib-shlibs-1.4-1022
/bin/mkdir -p /sw/src/fink.build/root-taglib-shlibs-1.4-1022/sw
/bin/mkdir -p /sw/src/fink.build/root-taglib-shlibs-1.4-1022/DEBIAN
/usr/sbin/chown -R root:admin /sw/src/fink.build/root-taglib-shlibs-1.4-1022
/usr/bin/install -d -m 755 /sw/src/fink.build/root-taglib-shlibs-1.4-1022/sw/lib
/bin/mv /sw/src/fink.build/root-taglib-1.4-1022/sw/lib/libtag.*.dylib /sw/src/fink.build/root-taglib-shlibs-1.4-1022/sw/lib/
mv: rename /sw/src/fink.build/root-taglib-1.4-1022/sw/lib/libtag.*.dylib to /sw/src/fink.build/root-taglib-shlibs-1.4-1022/sw/lib/libtag.*.dylib: No such file or directory
### execution of /bin/mv failed, exit code 1
Removing build lock...
/sw/bin/dpkg-lockwait -r fink-buildlock-taglib-1.4-1022
(Reading database ... 44746 files and directories currently installed.)
Removing fink-buildlock-taglib-1.4-1022 ...
Failed: phase installing: taglib-shlibs-1.4-1022 failed
Before reporting any errors, please run "fink selfupdate" and
try again. If you continue to have issues, please check to see if the
FAQ on fink's website solves the problem. If not, ask on the fink-users
or fink-beginners mailing lists. As a last resort, you can try e-mailing
the maintainer directly:
Benjamin Reed <taglib@fink.racoonfink.com>
Note that many fink package maintainers do not (yet) have access to OS X on
Intel hardware, so you may have better luck on the mailing lists.