gcc -Wall -DWITH_ZLIB -DWITH_PNG -DEMBED_TCL -DUSE_TCL_STUBS -march=i686 -Did386 -DWITH_XMMS -I/usr/include/glib-1.2 -I/usr/lib/glib/include -funsigned-char -pipe -fno-strict-aliasing -g -D_DEBUG -Wimplicit -I/usr/include -DWITH_VMODE -DWITH_DGA -DWITH_EVDEV -DWITH_JPEG -DGLQUAKE -o debug-x86/build-gl/image.o -c image.c
image.c:2549: error: expected declaration specifiers or ... before ( token
image.c:2549: error: expected declaration specifiers or ... before numeric constant
image.c:2549: error: expected declaration specifiers or ... before ( token
image.c:2553: warning: return type defaults to int
image.c: In function qjpeg_CreateCompress:
image.c:2553: error: storage class specified for parameter qjpeg_std_error
image.c:2555: error: storage class specified for parameter qjpeg_destroy_compress
image.c:2557: error: storage class specified for parameter qjpeg_set_defaults
image.c:2559: error: storage class specified for parameter qjpeg_set_quality
image.c:2561: error: storage class specified for parameter qjpeg_start_compress
image.c:2563: error: storage class specified for parameter qjpeg_write_scanlines
image.c:2565: error: storage class specified for parameter qjpeg_finish_compress
image.c:2567: error: storage class specified for parameter qjpeg_CreateCompress
image.c:2575: error: parameter jpegprocs is initialized
image.c:2577: warning: braces around scalar initializer
image.c:2577: warning: (near initialization for jpegprocs)
image.c:2577: warning: initialization from incompatible pointer type
image.c:2577: warning: excess elements in scalar initializer
image.c:2577: warning: (near initialization for jpegprocs)
image.c:2579: warning: braces around scalar initializer
image.c:2579: warning: (near initialization for jpegprocs)
image.c:2579: warning: initialization from incompatible pointer type
image.c:2579: warning: excess elements in scalar initializer
image.c:2579: warning: (near initialization for jpegprocs)
image.c:2579: warning: excess elements in scalar initializer
image.c:2579: warning: (near initialization for jpegprocs)
image.c:2581: warning: braces around scalar initializer
image.c:2581: warning: (near initialization for jpegprocs)
image.c:2581: warning: initialization from incompatible pointer type
image.c:2581: warning: excess elements in scalar initializer
image.c:2581: warning: (near initialization for jpegprocs)
image.c:2581: warning: excess elements in scalar initializer
image.c:2581: warning: (near initialization for jpegprocs)
image.c:2583: warning: braces around scalar initializer
image.c:2583: warning: (near initialization for jpegprocs)
image.c:2583: warning: initialization from incompatible pointer type
image.c:2583: warning: excess elements in scalar initializer
image.c:2583: warning: (near initialization for jpegprocs)
image.c:2583: warning: excess elements in scalar initializer
image.c:2583: warning: (near initialization for jpegprocs)
image.c:2585: warning: braces around scalar initializer
image.c:2585: warning: (near initialization for jpegprocs)
image.c:2585: warning: initialization from incompatible pointer type
image.c:2585: warning: excess elements in scalar initializer
image.c:2585: warning: (near initialization for jpegprocs)
image.c:2585: warning: excess elements in scalar initializer
image.c:2585: warning: (near initialization for jpegprocs)
image.c:2587: warning: braces around scalar initializer
image.c:2587: warning: (near initialization for jpegprocs)
image.c:2587: warning: initialization from incompatible pointer type
image.c:2587: warning: excess elements in scalar initializer
image.c:2587: warning: (near initialization for jpegprocs)
image.c:2587: warning: excess elements in scalar initializer
image.c:2587: warning: (near initialization for jpegprocs)
image.c:2589: warning: braces around scalar initializer
image.c:2589: warning: (near initialization for jpegprocs)
image.c:2589: warning: initialization from incompatible pointer type
image.c:2589: warning: excess elements in scalar initializer
image.c:2589: warning: (near initialization for jpegprocs)
image.c:2589: warning: excess elements in scalar initializer
image.c:2589: warning: (near initialization for jpegprocs)
image.c:2591: warning: braces around scalar initializer
image.c:2591: warning: (near initialization for jpegprocs)
image.c:2591: warning: initialization from incompatible pointer type
image.c:2591: warning: excess elements in scalar initializer
image.c:2591: warning: (near initialization for jpegprocs)
image.c:2591: warning: excess elements in scalar initializer
image.c:2591: warning: (near initialization for jpegprocs)
image.c:2597: error: expected =, ,, ;, asm or __attribute__ before { token
image.c:2607: error: expected =, ,, ;, asm or __attribute__ before { token
image.c:2673: error: storage class specified for parameter my_destination_mgr
image.c:2677: error: expected =, ,, ;, asm or __attribute__ before * token
image.c:2685: error: storage class specified for parameter jpeg_in_error
image.c:2685: error: parameter jpeg_in_error is initialized
image.c:2689: error: expected =, ,, ;, asm or __attribute__ before { token
image.c:2705: error: expected =, ,, ;, asm or __attribute__ before { token
image.c:2729: error: expected =, ,, ;, asm or __attribute__ before { token
image.c:2755: error: expected =, ,, ;, asm or __attribute__ before { token
image.c:2791: error: storage class specified for parameter jpeg_error_mgr_wrapper
image.c:2795: error: expected =, ,, ;, asm or __attribute__ before { token
image.c:2805: error: expected =, ,, ;, asm or __attribute__ before { token
image.c:3183: error: storage class specified for parameter pcx_t
image.c:3187: error: expected =, ,, ;, asm or __attribute__ before { token
image.c:3401: error: expected =, ,, ;, asm or __attribute__ before { token
image.c:3519: error: expected =, ,, ;, asm or __attribute__ before { token
image.c:3183: error: declaration for parameter pcx_t but no such parameter
image.c:2791: error: declaration for parameter jpeg_error_mgr_wrapper but no such parameter
image.c:2685: error: declaration for parameter jpeg_in_error but no such parameter
image.c:2673: error: declaration for parameter my_destination_mgr but no such parameter
image.c:2575: error: declaration for parameter jpegprocs but no such parameter
image.c:2567: error: declaration for parameter qjpeg_CreateCompress but no such parameter
image.c:2565: error: declaration for parameter qjpeg_finish_compress but no such parameter
image.c:2563: error: declaration for parameter qjpeg_write_scanlines but no such parameter
image.c:2561: error: declaration for parameter qjpeg_start_compress but no such parameter
image.c:2559: error: declaration for parameter qjpeg_set_quality but no such parameter
image.c:2557: error: declaration for parameter qjpeg_set_defaults but no such parameter
image.c:2555: error: declaration for parameter qjpeg_destroy_compress but no such parameter
image.c:2553: error: declaration for parameter qjpeg_std_error but no such parameter
image.c:3555: error: expected { at end of input
make[1]: *** [debug-x86/build-gl/image.o] Error 1
make[1]: Leaving directory `/var/abs/local/ezquake/ezquake-src'
make: *** [glx_debug] Error 2