All pastes #1051353 Raw Edit

Pitel

public text v1 · immutable
#1051353 ·published 2008-06-19 19:34 UTC
rendered paste body
[  3%] Building CXX object libs/owutil/thread/CMakeFiles/owthread.dir/src/Lockab
le.obj
In file included from C:\DOCUME~1\Pitel\QUTECO~1.2\libs\owutil/thread/Lockable.h:23,
                 from C:\Documents and Settings\Pitel\qutecom-2.2\libs\owutil\thread\src\Lockable.cpp:20:
C:\DOCUME~1\Pitel\QUTECO~1.2\libs\owutil/thread/RecursiveMutex.h: In member function 'void RecursiveMutex::lock()':
C:\DOCUME~1\Pitel\QUTECO~1.2\libs\owutil/thread/RecursiveMutex.h:37: error: 'boost::detail::thread' has not been declared
C:\DOCUME~1\Pitel\QUTECO~1.2\libs\owutil/thread/RecursiveMutex.h:37: error: expected primary-expression before '>' token
C:\DOCUME~1\Pitel\QUTECO~1.2\libs\owutil/thread/RecursiveMutex.h:37: error: '::lock' has not been declared
C:\DOCUME~1\Pitel\QUTECO~1.2\libs\owutil/thread/RecursiveMutex.h: In member function 'void RecursiveMutex::unlock()':
C:\DOCUME~1\Pitel\QUTECO~1.2\libs\owutil/thread/RecursiveMutex.h:41: error: 'boost::detail::thread' has not been declared
C:\DOCUME~1\Pitel\QUTECO~1.2\libs\owutil/thread/RecursiveMutex.h:41: error: expected primary-expression before '>' token
C:\DOCUME~1\Pitel\QUTECO~1.2\libs\owutil/thread/RecursiveMutex.h:41: error: '::unlock' has not been declared
make[2]: *** [libs/owutil/thread/CMakeFiles/owthread.dir/src/Lockable.obj] Error 1
make[1]: *** [libs/owutil/thread/CMakeFiles/owthread.dir/all] Error 2
make: *** [all] Error 2