C:\Dev\Wii\MyProjects\StepMania\StepManiaDev>make
Actor.cpp
In file included from c:\dev\devkitpro\devkitppc\bin\../lib/gcc/powerpc-gekko/4.2.3/../../../../powerpc-gekko/include/c++/4.2.3/bits/postypes
.h:46,
from c:\dev\devkitpro\devkitppc\bin\../lib/gcc/powerpc-gekko/4.2.3/../../../../powerpc-gekko/include/c++/4.2.3/iosfwd:49,
from c:\dev\devkitpro\devkitppc\bin\../lib/gcc/powerpc-gekko/4.2.3/../../../../powerpc-gekko/include/c++/4.2.3/bits/stl_algo
base.h:70,
from c:\dev\devkitpro\devkitppc\bin\../lib/gcc/powerpc-gekko/4.2.3/../../../../powerpc-gekko/include/c++/4.2.3/algorithm:65,
from c:/Dev/Wii/MyProjects/StepMania/StepManiaDev/source/global.h:56,
from c:/Dev/Wii/MyProjects/StepMania/StepManiaDev/source/Actor.cpp:1:
c:\dev\devkitpro\devkitppc\bin\../lib/gcc/powerpc-gekko/4.2.3/../../../../powerpc-gekko/include/c++/4.2.3/cwchar:149: error: '::fgetwc' has n
ot been declared
c:\dev\devkitpro\devkitppc\bin\../lib/gcc/powerpc-gekko/4.2.3/../../../../powerpc-gekko/include/c++/4.2.3/cwchar:150: error: '::fgetws' has n
ot been declared
c:\dev\devkitpro\devkitppc\bin\../lib/gcc/powerpc-gekko/4.2.3/../../../../powerpc-gekko/include/c++/4.2.3/cwchar:151: error: '::fputwc' has n
ot been declared
c:\dev\devkitpro\devkitppc\bin\../lib/gcc/powerpc-gekko/4.2.3/../../../../powerpc-gekko/include/c++/4.2.3/cwchar:152: error: '::fputws' has n
ot been declared
c:\dev\devkitpro\devkitppc\bin\../lib/gcc/powerpc-gekko/4.2.3/../../../../powerpc-gekko/include/c++/4.2.3/cwchar:153: error: '::fwide' has no
t been declared
c:\dev\devkitpro\devkitppc\bin\../lib/gcc/powerpc-gekko/4.2.3/../../../../powerpc-gekko/include/c++/4.2.3/cwchar:154: error: '::fwprintf' has
not been declared
c:\dev\devkitpro\devkitppc\bin\../lib/gcc/powerpc-gekko/4.2.3/../../../../powerpc-gekko/include/c++/4.2.3/cwchar:155: error: '::fwscanf' has
not been declared
c:\dev\devkitpro\devkitppc\bin\../lib/gcc/powerpc-gekko/4.2.3/../../../../powerpc-gekko/include/c++/4.2.3/cwchar:156: error: '::getwc' has no
t been declared
c:\dev\devkitpro\devkitppc\bin\../lib/gcc/powerpc-gekko/4.2.3/../../../../powerpc-gekko/include/c++/4.2.3/cwchar:157: error: '::getwchar' has
not been declared
c:\dev\devkitpro\devkitppc\bin\../lib/gcc/powerpc-gekko/4.2.3/../../../../powerpc-gekko/include/c++/4.2.3/cwchar:162: error: '::putwc' has no
t been declared
c:\dev\devkitpro\devkitppc\bin\../lib/gcc/powerpc-gekko/4.2.3/../../../../powerpc-gekko/include/c++/4.2.3/cwchar:163: error: '::putwchar' has
not been declared
c:\dev\devkitpro\devkitppc\bin\../lib/gcc/powerpc-gekko/4.2.3/../../../../powerpc-gekko/include/c++/4.2.3/cwchar:164: error: '::swprintf' has
not been declared
c:\dev\devkitpro\devkitppc\bin\../lib/gcc/powerpc-gekko/4.2.3/../../../../powerpc-gekko/include/c++/4.2.3/cwchar:165: error: '::swscanf' has
not been declared
c:\dev\devkitpro\devkitppc\bin\../lib/gcc/powerpc-gekko/4.2.3/../../../../powerpc-gekko/include/c++/4.2.3/cwchar:166: error: '::ungetwc' has
not been declared
c:\dev\devkitpro\devkitppc\bin\../lib/gcc/powerpc-gekko/4.2.3/../../../../powerpc-gekko/include/c++/4.2.3/cwchar:167: error: '::vfwprintf' ha
s not been declared
c:\dev\devkitpro\devkitppc\bin\../lib/gcc/powerpc-gekko/4.2.3/../../../../powerpc-gekko/include/c++/4.2.3/cwchar:171: error: '::vswprintf' ha
s not been declared
c:\dev\devkitpro\devkitppc\bin\../lib/gcc/powerpc-gekko/4.2.3/../../../../powerpc-gekko/include/c++/4.2.3/cwchar:175: error: '::vwprintf' has
not been declared
c:\dev\devkitpro\devkitppc\bin\../lib/gcc/powerpc-gekko/4.2.3/../../../../powerpc-gekko/include/c++/4.2.3/cwchar:185: error: '::wcsftime' has
not been declared
c:\dev\devkitpro\devkitppc\bin\../lib/gcc/powerpc-gekko/4.2.3/../../../../powerpc-gekko/include/c++/4.2.3/cwchar:192: error: '::wcstod' has n
ot been declared
c:\dev\devkitpro\devkitppc\bin\../lib/gcc/powerpc-gekko/4.2.3/../../../../powerpc-gekko/include/c++/4.2.3/cwchar:196: error: '::wcstok' has n
ot been declared
c:\dev\devkitpro\devkitppc\bin\../lib/gcc/powerpc-gekko/4.2.3/../../../../powerpc-gekko/include/c++/4.2.3/cwchar:205: error: '::wprintf' has
not been declared
c:\dev\devkitpro\devkitppc\bin\../lib/gcc/powerpc-gekko/4.2.3/../../../../powerpc-gekko/include/c++/4.2.3/cwchar:206: error: '::wscanf' has n
ot been declared
c:/Dev/Wii/MyProjects/StepMania/StepManiaDev/source/Actor.cpp: In member function 'virtual void Actor::UpdateInternal(float)':
c:/Dev/Wii/MyProjects/StepMania/StepManiaDev/source/Actor.cpp:680: warning: enumeration value 'no_effect' not handled in switch
c:/Dev/Wii/MyProjects/StepMania/StepManiaDev/source/Actor.cpp:680: warning: enumeration value 'diffuse_blink' not handled in switch
c:/Dev/Wii/MyProjects/StepMania/StepManiaDev/source/Actor.cpp:680: warning: enumeration value 'diffuse_shift' not handled in switch
c:/Dev/Wii/MyProjects/StepMania/StepManiaDev/source/Actor.cpp:680: warning: enumeration value 'diffuse_ramp' not handled in switch
c:/Dev/Wii/MyProjects/StepMania/StepManiaDev/source/Actor.cpp:680: warning: enumeration value 'glow_blink' not handled in switch
c:/Dev/Wii/MyProjects/StepMania/StepManiaDev/source/Actor.cpp:680: warning: enumeration value 'glow_shift' not handled in switch
c:/Dev/Wii/MyProjects/StepMania/StepManiaDev/source/Actor.cpp:680: warning: enumeration value 'rainbow' not handled in switch
c:/Dev/Wii/MyProjects/StepMania/StepManiaDev/source/Actor.cpp:680: warning: enumeration value 'wag' not handled in switch
c:/Dev/Wii/MyProjects/StepMania/StepManiaDev/source/Actor.cpp:680: warning: enumeration value 'bounce' not handled in switch
c:/Dev/Wii/MyProjects/StepMania/StepManiaDev/source/Actor.cpp:680: warning: enumeration value 'bob' not handled in switch
c:/Dev/Wii/MyProjects/StepMania/StepManiaDev/source/Actor.cpp:680: warning: enumeration value 'pulse' not handled in switch
c:/Dev/Wii/MyProjects/StepMania/StepManiaDev/source/Actor.cpp:680: warning: enumeration value 'vibrate' not handled in switch
make[1]: *** [Actor.o] Error 1
make: *** [build] Error 2
C:\Dev\Wii\MyProjects\StepMania\StepManiaDev>