NOTE:[13:48] package cfu1-driver-2.6: started
NOTE:[13:48] package cfu1-driver-2.6-r0: task do_clean: started
NOTE:[13:48] removing /home/hrw/zaurus/oe/build/0422/tmp/work/c7x0-linux/cfu1-driver-2.6-r0
NOTE:[13:48] removing /home/hrw/zaurus/oe/build/0422/tmp/stamps/c7x0-linux/cfu1-driver-2.6-r0.*
NOTE:[13:48] package cfu1-driver-2.6-r0: task do_clean: completed
NOTE:[13:48] package cfu1-driver-2.6: completed
Build statistics:
Attempted builds: 1
NOTE:[13:48] package cfu1-driver-2.6: started
NOTE:[13:48] package cfu1-driver-2.6-r0: task do_fetch: started
NOTE:[13:48] package cfu1-driver-2.6-r0: task do_fetch: completed
NOTE:[13:48] package cfu1-driver-2.6-r0: task do_unpack: started
NOTE:[13:48] Unpacking /home/hrw/zaurus/oe/openembedded/packages/cfu1/files/rex-cfu1.conf to /home/hrw/zaurus/oe/build/0422/tmp/work/c7x0-linux/cfu1-driver-2.6-r0/
NOTE:[13:48] Unpacking /home/hrw/zaurus/oe/openembedded/packages/cfu1/files/Makefile to /home/hrw/zaurus/oe/build/0422/tmp/work/c7x0-linux/cfu1-driver-2.6-r0/
NOTE:[13:48] Unpacking /home/hrw/zaurus/oe/openembedded/packages/cfu1/files/sl811_cs.c to /home/hrw/zaurus/oe/build/0422/tmp/work/c7x0-linux/cfu1-driver-2.6-r0/
NOTE:[13:48] package cfu1-driver-2.6-r0: task do_unpack: completed
NOTE:[13:48] package cfu1-driver-2.6-r0: task do_patch: started
NOTE:[13:48] package cfu1-driver-2.6-r0: task do_patch: completed
NOTE:[13:48] package cfu1-driver-2.6-r0: task do_configure: started
NOTE:[13:48] package cfu1-driver-2.6-r0: task do_configure: completed
NOTE:[13:48] package cfu1-driver-2.6-r0: task do_compile: started
ERROR: function do_compile failed
ERROR: log data follows (/home/hrw/zaurus/oe/build/0422/tmp/work/c7x0-linux/cfu1-driver-2.6-r0/temp/log.do_compile.17325)
| NOTE: make -e MAKEFLAGS= -C /home/hrw/zaurus/oe/build/0422/tmp/work/c7x0-linux/linux-openzaurus-2.6.11-r16/linux-2.6.11 SUBDIRS=/home/hrw/zaurus/oe/build/0422/tmp/work/c7x0-linux/cfu1-driver-2.6-r0 modules
| make: Entering directory `/home/hrw/zaurus/oe/build/0422/tmp/work/c7x0-linux/linux-openzaurus-2.6.11-r16/linux-2.6.11'
| make[1]: Entering directory `/home/hrw/zaurus/oe/build/0422/tmp/work/c7x0-linux/linux-openzaurus-2.6.11-r16/linux-2.6.11'
| CC [M] /home/hrw/zaurus/oe/build/0422/tmp/work/c7x0-linux/cfu1-driver-2.6-r0/sl811_cs.o
| In file included from /home/hrw/zaurus/oe/build/0422/tmp/staging/arm-linux/include/linux/sched.h:16,
| from /home/hrw/zaurus/oe/build/0422/tmp/staging/arm-linux/include/linux/module.h:9,
| from /home/hrw/zaurus/oe/build/0422/tmp/work/c7x0-linux/cfu1-driver-2.6-r0/sl811_cs.c:11:
| /home/hrw/zaurus/oe/build/0422/tmp/staging/arm-linux/include/linux/signal.h:2:2: warning: #warning "You should include <signal.h>. This time I will do it for you."
| In file included from /home/hrw/zaurus/oe/build/0422/tmp/staging/arm-linux/include/linux/sched.h:79,
| from /home/hrw/zaurus/oe/build/0422/tmp/staging/arm-linux/include/linux/module.h:9,
| from /home/hrw/zaurus/oe/build/0422/tmp/work/c7x0-linux/cfu1-driver-2.6-r0/sl811_cs.c:11:
| /home/hrw/zaurus/oe/build/0422/tmp/staging/arm-linux/include/linux/resource.h:2:2: warning: #warning "You should include <sys/resource.h>. This time I will do it for you."
| In file included from /home/hrw/zaurus/oe/build/0422/tmp/work/c7x0-linux/cfu1-driver-2.6-r0/sl811_cs.c:11:
| /home/hrw/zaurus/oe/build/0422/tmp/staging/arm-linux/include/linux/module.h:41: error: field `attr' has incomplete type
| /home/hrw/zaurus/oe/build/0422/tmp/staging/arm-linux/include/linux/module.h:49: error: field `kobj' has incomplete type
| /home/hrw/zaurus/oe/build/0422/tmp/work/c7x0-linux/cfu1-driver-2.6-r0/sl811_cs.c:15:24: linux/slab.h: No such file or directory
| /home/hrw/zaurus/oe/build/0422/tmp/work/c7x0-linux/cfu1-driver-2.6-r0/sl811_cs.c:16:26: linux/string.h: No such file or directory
| /home/hrw/zaurus/oe/build/0422/tmp/work/c7x0-linux/cfu1-driver-2.6-r0/sl811_cs.c:17:25: linux/timer.h: No such file or directory
| In file included from /home/hrw/zaurus/oe/build/0422/tmp/work/c7x0-linux/cfu1-driver-2.6-r0/sl811_cs.c:20:
| /home/hrw/zaurus/oe/build/0422/tmp/staging/arm-linux/include/asm/io.h:1:2: warning: #warning "You should include <sys/io.h>. This time I will do it for you."
| /home/hrw/zaurus/oe/build/0422/tmp/work/c7x0-linux/cfu1-driver-2.6-r0/sl811_cs.c:23:28: pcmcia/version.h: No such file or directory
| /home/hrw/zaurus/oe/build/0422/tmp/work/c7x0-linux/cfu1-driver-2.6-r0/sl811_cs.c:24:29: pcmcia/cs_types.h: No such file or directory
| /home/hrw/zaurus/oe/build/0422/tmp/work/c7x0-linux/cfu1-driver-2.6-r0/sl811_cs.c:25:23: pcmcia/cs.h: No such file or directory
| /home/hrw/zaurus/oe/build/0422/tmp/work/c7x0-linux/cfu1-driver-2.6-r0/sl811_cs.c:26:27: pcmcia/cistpl.h: No such file or directory
| /home/hrw/zaurus/oe/build/0422/tmp/work/c7x0-linux/cfu1-driver-2.6-r0/sl811_cs.c:27:27: pcmcia/cisreg.h: No such file or directory
| /home/hrw/zaurus/oe/build/0422/tmp/work/c7x0-linux/cfu1-driver-2.6-r0/sl811_cs.c:28:23: pcmcia/ds.h: No such file or directory
| /home/hrw/zaurus/oe/build/0422/tmp/work/c7x0-linux/cfu1-driver-2.6-r0/sl811_cs.c:59: error: parse error before "dev_info"
| /home/hrw/zaurus/oe/build/0422/tmp/work/c7x0-linux/cfu1-driver-2.6-r0/sl811_cs.c:59: warning: initialization makes integer from pointer without a cast
| /home/hrw/zaurus/oe/build/0422/tmp/work/c7x0-linux/cfu1-driver-2.6-r0/sl811_cs.c:59: warning: data definition has no type or storage class
| /home/hrw/zaurus/oe/build/0422/tmp/work/c7x0-linux/cfu1-driver-2.6-r0/sl811_cs.c:60: error: parse error before '*' token
| /home/hrw/zaurus/oe/build/0422/tmp/work/c7x0-linux/cfu1-driver-2.6-r0/sl811_cs.c:60: warning: data definition has no type or storage class
| /home/hrw/zaurus/oe/build/0422/tmp/work/c7x0-linux/cfu1-driver-2.6-r0/sl811_cs.c:74: error: parse error before '*' token
| /home/hrw/zaurus/oe/build/0422/tmp/work/c7x0-linux/cfu1-driver-2.6-r0/sl811_cs.c:74: warning: data definition has no type or storage class
| /home/hrw/zaurus/oe/build/0422/tmp/work/c7x0-linux/cfu1-driver-2.6-r0/sl811_cs.c:75: error: parse error before '*' token
| /home/hrw/zaurus/oe/build/0422/tmp/work/c7x0-linux/cfu1-driver-2.6-r0/sl811_cs.c:76: error: parse error before '*' token
| /home/hrw/zaurus/oe/build/0422/tmp/work/c7x0-linux/cfu1-driver-2.6-r0/sl811_cs.c:77: error: parse error before '*' token
| /home/hrw/zaurus/oe/build/0422/tmp/work/c7x0-linux/cfu1-driver-2.6-r0/sl811_cs.c:78: error: parse error before "event"
| /home/hrw/zaurus/oe/build/0422/tmp/work/c7x0-linux/cfu1-driver-2.6-r0/sl811_cs.c:86: error: parse error before "dev_link_t"
| /home/hrw/zaurus/oe/build/0422/tmp/work/c7x0-linux/cfu1-driver-2.6-r0/sl811_cs.c:86: warning: no semicolon at end of struct or union
| /home/hrw/zaurus/oe/build/0422/tmp/work/c7x0-linux/cfu1-driver-2.6-r0/sl811_cs.c:87: warning: data definition has no type or storage class
| /home/hrw/zaurus/oe/build/0422/tmp/work/c7x0-linux/cfu1-driver-2.6-r0/sl811_cs.c:88: warning: data definition has no type or storage class
| /home/hrw/zaurus/oe/build/0422/tmp/work/c7x0-linux/cfu1-driver-2.6-r0/sl811_cs.c:91: error: variable `sl811_driver' has initializer but incomplete type
| /home/hrw/zaurus/oe/build/0422/tmp/work/c7x0-linux/cfu1-driver-2.6-r0/sl811_cs.c:92: error: unknown field `owner' specified in initializer
| /home/hrw/zaurus/oe/build/0422/tmp/work/c7x0-linux/cfu1-driver-2.6-r0/sl811_cs.c:92: warning: excess elements in struct initializer
| /home/hrw/zaurus/oe/build/0422/tmp/work/c7x0-linux/cfu1-driver-2.6-r0/sl811_cs.c:92: warning: (near initialization for `sl811_driver')
| /home/hrw/zaurus/oe/build/0422/tmp/work/c7x0-linux/cfu1-driver-2.6-r0/sl811_cs.c:93: error: unknown field `drv' specified in initializer
| /home/hrw/zaurus/oe/build/0422/tmp/work/c7x0-linux/cfu1-driver-2.6-r0/sl811_cs.c:93: error: extra brace group at end of initializer
| /home/hrw/zaurus/oe/build/0422/tmp/work/c7x0-linux/cfu1-driver-2.6-r0/sl811_cs.c:93: error: (near initialization for `sl811_driver')
| /home/hrw/zaurus/oe/build/0422/tmp/work/c7x0-linux/cfu1-driver-2.6-r0/sl811_cs.c:95: warning: excess elements in struct initializer
| /home/hrw/zaurus/oe/build/0422/tmp/work/c7x0-linux/cfu1-driver-2.6-r0/sl811_cs.c:95: warning: (near initialization for `sl811_driver')
| /home/hrw/zaurus/oe/build/0422/tmp/work/c7x0-linux/cfu1-driver-2.6-r0/sl811_cs.c:96: error: unknown field `attach' specified in initializer
| /home/hrw/zaurus/oe/build/0422/tmp/work/c7x0-linux/cfu1-driver-2.6-r0/sl811_cs.c:96: warning: excess elements in struct initializer
| /home/hrw/zaurus/oe/build/0422/tmp/work/c7x0-linux/cfu1-driver-2.6-r0/sl811_cs.c:96: warning: (near initialization for `sl811_driver')
| /home/hrw/zaurus/oe/build/0422/tmp/work/c7x0-linux/cfu1-driver-2.6-r0/sl811_cs.c:97: error: unknown field `detach' specified in initializer
| /home/hrw/zaurus/oe/build/0422/tmp/work/c7x0-linux/cfu1-driver-2.6-r0/sl811_cs.c:97: warning: excess elements in struct initializer
| /home/hrw/zaurus/oe/build/0422/tmp/work/c7x0-linux/cfu1-driver-2.6-r0/sl811_cs.c:97: warning: (near initialization for `sl811_driver')
| /home/hrw/zaurus/oe/build/0422/tmp/work/c7x0-linux/cfu1-driver-2.6-r0/sl811_cs.c:107: error: parse error before "handle"
| /home/hrw/zaurus/oe/build/0422/tmp/work/c7x0-linux/cfu1-driver-2.6-r0/sl811_cs.c: In function `sl811_cs_error':
| /home/hrw/zaurus/oe/build/0422/tmp/work/c7x0-linux/cfu1-driver-2.6-r0/sl811_cs.c:109: error: `error_info_t' undeclared (first use in this function)
| /home/hrw/zaurus/oe/build/0422/tmp/work/c7x0-linux/cfu1-driver-2.6-r0/sl811_cs.c:109: error: (Each undeclared identifier is reported only once
| /home/hrw/zaurus/oe/build/0422/tmp/work/c7x0-linux/cfu1-driver-2.6-r0/sl811_cs.c:109: error: for each function it appears in.)
| /home/hrw/zaurus/oe/build/0422/tmp/work/c7x0-linux/cfu1-driver-2.6-r0/sl811_cs.c:109: error: parse error before "err"
| /home/hrw/zaurus/oe/build/0422/tmp/work/c7x0-linux/cfu1-driver-2.6-r0/sl811_cs.c: At top level:
| /home/hrw/zaurus/oe/build/0422/tmp/work/c7x0-linux/cfu1-driver-2.6-r0/sl811_cs.c:110: error: parse error before '&' token
| /home/hrw/zaurus/oe/build/0422/tmp/work/c7x0-linux/cfu1-driver-2.6-r0/sl811_cs.c:110: warning: data definition has no type or storage class
| /home/hrw/zaurus/oe/build/0422/tmp/work/c7x0-linux/cfu1-driver-2.6-r0/sl811_cs.c:120: error: parse error before '*' token
| /home/hrw/zaurus/oe/build/0422/tmp/work/c7x0-linux/cfu1-driver-2.6-r0/sl811_cs.c: In function `sl811_cs_attach':
| /home/hrw/zaurus/oe/build/0422/tmp/work/c7x0-linux/cfu1-driver-2.6-r0/sl811_cs.c:122: error: `local' undeclared (first use in this function)
| /home/hrw/zaurus/oe/build/0422/tmp/work/c7x0-linux/cfu1-driver-2.6-r0/sl811_cs.c:123: error: `dev_link_t' undeclared (first use in this function)
| /home/hrw/zaurus/oe/build/0422/tmp/work/c7x0-linux/cfu1-driver-2.6-r0/sl811_cs.c:124: error: `client_reg_t' undeclared (first use in this function)
| /home/hrw/zaurus/oe/build/0422/tmp/work/c7x0-linux/cfu1-driver-2.6-r0/sl811_cs.c:124: error: parse error before "client_reg"
| /home/hrw/zaurus/oe/build/0422/tmp/work/c7x0-linux/cfu1-driver-2.6-r0/sl811_cs.c:127: error: `GFP_KERNEL' undeclared (first use in this function)
| /home/hrw/zaurus/oe/build/0422/tmp/work/c7x0-linux/cfu1-driver-2.6-r0/sl811_cs.c:130: error: request for member `priv' in something not a structure or union
| /home/hrw/zaurus/oe/build/0422/tmp/work/c7x0-linux/cfu1-driver-2.6-r0/sl811_cs.c:139: error: request for member `irq' in something not a structure or union
| /home/hrw/zaurus/oe/build/0422/tmp/work/c7x0-linux/cfu1-driver-2.6-r0/sl811_cs.c:139: error: `IRQ_TYPE_EXCLUSIVE' undeclared (first use in this function)
| /home/hrw/zaurus/oe/build/0422/tmp/work/c7x0-linux/cfu1-driver-2.6-r0/sl811_cs.c:140: error: request for member `irq' in something not a structure or union
| /home/hrw/zaurus/oe/build/0422/tmp/work/c7x0-linux/cfu1-driver-2.6-r0/sl811_cs.c:140: error: `IRQ_INFO2_VALID' undeclared (first use in this function)
| /home/hrw/zaurus/oe/build/0422/tmp/work/c7x0-linux/cfu1-driver-2.6-r0/sl811_cs.c:140: error: `IRQ_LEVEL_ID' undeclared (first use in this function)
| /home/hrw/zaurus/oe/build/0422/tmp/work/c7x0-linux/cfu1-driver-2.6-r0/sl811_cs.c:142: error: request for member `irq' in something not a structure or union
| /home/hrw/zaurus/oe/build/0422/tmp/work/c7x0-linux/cfu1-driver-2.6-r0/sl811_cs.c:145: error: request for member `irq' in something not a structure or union
| /home/hrw/zaurus/oe/build/0422/tmp/work/c7x0-linux/cfu1-driver-2.6-r0/sl811_cs.c:146: error: request for member `irq' in something not a structure or union
| /home/hrw/zaurus/oe/build/0422/tmp/work/c7x0-linux/cfu1-driver-2.6-r0/sl811_cs.c:148: error: request for member `conf' in something not a structure or union
| /home/hrw/zaurus/oe/build/0422/tmp/work/c7x0-linux/cfu1-driver-2.6-r0/sl811_cs.c:149: error: request for member `conf' in something not a structure or union
| /home/hrw/zaurus/oe/build/0422/tmp/work/c7x0-linux/cfu1-driver-2.6-r0/sl811_cs.c:150: error: request for member `conf' in something not a structure or union
| /home/hrw/zaurus/oe/build/0422/tmp/work/c7x0-linux/cfu1-driver-2.6-r0/sl811_cs.c:150: error: `INT_MEMORY_AND_IO' undeclared (first use in this function)
| /home/hrw/zaurus/oe/build/0422/tmp/work/c7x0-linux/cfu1-driver-2.6-r0/sl811_cs.c:153: error: request for member `next' in something not a structure or union
| /home/hrw/zaurus/oe/build/0422/tmp/work/c7x0-linux/cfu1-driver-2.6-r0/sl811_cs.c:154: warning: assignment from incompatible pointer type
| /home/hrw/zaurus/oe/build/0422/tmp/work/c7x0-linux/cfu1-driver-2.6-r0/sl811_cs.c:155: error: `client_reg' undeclared (first use in this function)
| /home/hrw/zaurus/oe/build/0422/tmp/work/c7x0-linux/cfu1-driver-2.6-r0/sl811_cs.c:156: error: `INFO_IO_CLIENT' undeclared (first use in this function)
| /home/hrw/zaurus/oe/build/0422/tmp/work/c7x0-linux/cfu1-driver-2.6-r0/sl811_cs.c:156: error: `INFO_CARD_SHARE' undeclared (first use in this function)
| /home/hrw/zaurus/oe/build/0422/tmp/work/c7x0-linux/cfu1-driver-2.6-r0/sl811_cs.c:158: error: `CS_EVENT_CARD_INSERTION' undeclared (first use in this function)
| /home/hrw/zaurus/oe/build/0422/tmp/work/c7x0-linux/cfu1-driver-2.6-r0/sl811_cs.c:158: error: `CS_EVENT_CARD_REMOVAL' undeclared (first use in this function)
| /home/hrw/zaurus/oe/build/0422/tmp/work/c7x0-linux/cfu1-driver-2.6-r0/sl811_cs.c:159: error: `CS_EVENT_RESET_PHYSICAL' undeclared (first use in this function)
| /home/hrw/zaurus/oe/build/0422/tmp/work/c7x0-linux/cfu1-driver-2.6-r0/sl811_cs.c:159: error: `CS_EVENT_CARD_RESET' undeclared (first use in this function)
| /home/hrw/zaurus/oe/build/0422/tmp/work/c7x0-linux/cfu1-driver-2.6-r0/sl811_cs.c:160: error: `CS_EVENT_PM_SUSPEND' undeclared (first use in this function)
| /home/hrw/zaurus/oe/build/0422/tmp/work/c7x0-linux/cfu1-driver-2.6-r0/sl811_cs.c:160: error: `CS_EVENT_PM_RESUME' undeclared (first use in this function)
| /home/hrw/zaurus/oe/build/0422/tmp/work/c7x0-linux/cfu1-driver-2.6-r0/sl811_cs.c:164: error: request for member `handle' in something not a structure or union
| /home/hrw/zaurus/oe/build/0422/tmp/work/c7x0-linux/cfu1-driver-2.6-r0/sl811_cs.c:165: error: `CS_SUCCESS' undeclared (first use in this function)
| /home/hrw/zaurus/oe/build/0422/tmp/work/c7x0-linux/cfu1-driver-2.6-r0/sl811_cs.c:166: error: request for member `handle' in something not a structure or union
| /home/hrw/zaurus/oe/build/0422/tmp/work/c7x0-linux/cfu1-driver-2.6-r0/sl811_cs.c:166: error: `RegisterClient' undeclared (first use in this function)
| /home/hrw/zaurus/oe/build/0422/tmp/work/c7x0-linux/cfu1-driver-2.6-r0/sl811_cs.c:171: warning: return from incompatible pointer type
| /home/hrw/zaurus/oe/build/0422/tmp/work/c7x0-linux/cfu1-driver-2.6-r0/sl811_cs.c: At top level:
| /home/hrw/zaurus/oe/build/0422/tmp/work/c7x0-linux/cfu1-driver-2.6-r0/sl811_cs.c:176: error: parse error before '*' token
| /home/hrw/zaurus/oe/build/0422/tmp/work/c7x0-linux/cfu1-driver-2.6-r0/sl811_cs.c: In function `sl811_cs_detach':
| /home/hrw/zaurus/oe/build/0422/tmp/work/c7x0-linux/cfu1-driver-2.6-r0/sl811_cs.c:178: error: `dev_link_t' undeclared (first use in this function)
| /home/hrw/zaurus/oe/build/0422/tmp/work/c7x0-linux/cfu1-driver-2.6-r0/sl811_cs.c:178: error: `linkp' undeclared (first use in this function)
| /home/hrw/zaurus/oe/build/0422/tmp/work/c7x0-linux/cfu1-driver-2.6-r0/sl811_cs.c:200: error: request for member `handle' in something not a structure or union
| /home/hrw/zaurus/oe/build/0422/tmp/work/c7x0-linux/cfu1-driver-2.6-r0/sl811_cs.c:201: error: request for member `handle' in something not a structure or union
| /home/hrw/zaurus/oe/build/0422/tmp/work/c7x0-linux/cfu1-driver-2.6-r0/sl811_cs.c:204: error: request for member `next' in something not a structure or union
| /home/hrw/zaurus/oe/build/0422/tmp/work/c7x0-linux/cfu1-driver-2.6-r0/sl811_cs.c:206: error: request for member `priv' in something not a structure or union
| /home/hrw/zaurus/oe/build/0422/tmp/work/c7x0-linux/cfu1-driver-2.6-r0/sl811_cs.c: At top level:
| /home/hrw/zaurus/oe/build/0422/tmp/work/c7x0-linux/cfu1-driver-2.6-r0/sl811_cs.c:212: error: parse error before '*' token
| /home/hrw/zaurus/oe/build/0422/tmp/work/c7x0-linux/cfu1-driver-2.6-r0/sl811_cs.c: In function `sl811_cs_config':
| /home/hrw/zaurus/oe/build/0422/tmp/work/c7x0-linux/cfu1-driver-2.6-r0/sl811_cs.c:214: error: `client_handle_t' undeclared (first use in this function)
| /home/hrw/zaurus/oe/build/0422/tmp/work/c7x0-linux/cfu1-driver-2.6-r0/sl811_cs.c:214: error: parse error before "handle"
| /home/hrw/zaurus/oe/build/0422/tmp/work/c7x0-linux/cfu1-driver-2.6-r0/sl811_cs.c:215: error: `dev' undeclared (first use in this function)
| /home/hrw/zaurus/oe/build/0422/tmp/work/c7x0-linux/cfu1-driver-2.6-r0/sl811_cs.c:215: error: request for member `priv' in something not a structure or union
| /home/hrw/zaurus/oe/build/0422/tmp/work/c7x0-linux/cfu1-driver-2.6-r0/sl811_cs.c:216: error: `tuple_t' undeclared (first use in this function)
| /home/hrw/zaurus/oe/build/0422/tmp/work/c7x0-linux/cfu1-driver-2.6-r0/sl811_cs.c:216: error: parse error before "tuple"
| /home/hrw/zaurus/oe/build/0422/tmp/work/c7x0-linux/cfu1-driver-2.6-r0/sl811_cs.c:217: error: `cisparse_t' undeclared (first use in this function)
| /home/hrw/zaurus/oe/build/0422/tmp/work/c7x0-linux/cfu1-driver-2.6-r0/sl811_cs.c:220: error: `config_info_t' undeclared (first use in this function)
| /home/hrw/zaurus/oe/build/0422/tmp/work/c7x0-linux/cfu1-driver-2.6-r0/sl811_cs.c:220: error: parse error before "conf"
| /home/hrw/zaurus/oe/build/0422/tmp/work/c7x0-linux/cfu1-driver-2.6-r0/sl811_cs.c:221: error: `cistpl_cftable_entry_t' undeclared (first use in this function)
| /home/hrw/zaurus/oe/build/0422/tmp/work/c7x0-linux/cfu1-driver-2.6-r0/sl811_cs.c:225: error: `tuple' undeclared (first use in this function)
| /home/hrw/zaurus/oe/build/0422/tmp/work/c7x0-linux/cfu1-driver-2.6-r0/sl811_cs.c:225: error: `CISTPL_CONFIG' undeclared (first use in this function)
| /home/hrw/zaurus/oe/build/0422/tmp/work/c7x0-linux/cfu1-driver-2.6-r0/sl811_cs.c:230: error: `GetFirstTuple' undeclared (first use in this function)
| /home/hrw/zaurus/oe/build/0422/tmp/work/c7x0-linux/cfu1-driver-2.6-r0/sl811_cs.c:230: error: `handle' undeclared (first use in this function)
| /home/hrw/zaurus/oe/build/0422/tmp/work/c7x0-linux/cfu1-driver-2.6-r0/sl811_cs.c:231: error: `GetTupleData' undeclared (first use in this function)
| /home/hrw/zaurus/oe/build/0422/tmp/work/c7x0-linux/cfu1-driver-2.6-r0/sl811_cs.c:232: error: `ParseTuple' undeclared (first use in this function)
| /home/hrw/zaurus/oe/build/0422/tmp/work/c7x0-linux/cfu1-driver-2.6-r0/sl811_cs.c:232: error: `parse' undeclared (first use in this function)
| /home/hrw/zaurus/oe/build/0422/tmp/work/c7x0-linux/cfu1-driver-2.6-r0/sl811_cs.c:233: error: request for member `conf' in something not a structure or union
| /home/hrw/zaurus/oe/build/0422/tmp/work/c7x0-linux/cfu1-driver-2.6-r0/sl811_cs.c:234: error: request for member `conf' in something not a structure or union
| /home/hrw/zaurus/oe/build/0422/tmp/work/c7x0-linux/cfu1-driver-2.6-r0/sl811_cs.c:237: error: request for member `state' in something not a structure or union
| /home/hrw/zaurus/oe/build/0422/tmp/work/c7x0-linux/cfu1-driver-2.6-r0/sl811_cs.c:237: error: `DEV_CONFIG' undeclared (first use in this function)
| /home/hrw/zaurus/oe/build/0422/tmp/work/c7x0-linux/cfu1-driver-2.6-r0/sl811_cs.c:240: error: `GetConfigurationInfo' undeclared (first use in this function)
| /home/hrw/zaurus/oe/build/0422/tmp/work/c7x0-linux/cfu1-driver-2.6-r0/sl811_cs.c:240: error: `conf' undeclared (first use in this function)
| /home/hrw/zaurus/oe/build/0422/tmp/work/c7x0-linux/cfu1-driver-2.6-r0/sl811_cs.c:241: error: request for member `conf' in something not a structure or union
| /home/hrw/zaurus/oe/build/0422/tmp/work/c7x0-linux/cfu1-driver-2.6-r0/sl811_cs.c:243: error: `CISTPL_CFTABLE_ENTRY' undeclared (first use in this function)
| /home/hrw/zaurus/oe/build/0422/tmp/work/c7x0-linux/cfu1-driver-2.6-r0/sl811_cs.c:246: error: `cfg' undeclared (first use in this function)
| /home/hrw/zaurus/oe/build/0422/tmp/work/c7x0-linux/cfu1-driver-2.6-r0/sl811_cs.c:251: error: `CISTPL_CFTABLE_DEFAULT' undeclared (first use in this function)
| /home/hrw/zaurus/oe/build/0422/tmp/work/c7x0-linux/cfu1-driver-2.6-r0/sl811_cs.c:252: error: `dflt' undeclared (first use in this function)
| /home/hrw/zaurus/oe/build/0422/tmp/work/c7x0-linux/cfu1-driver-2.6-r0/sl811_cs.c:257: error: request for member `conf' in something not a structure or union
| /home/hrw/zaurus/oe/build/0422/tmp/work/c7x0-linux/cfu1-driver-2.6-r0/sl811_cs.c:260: error: `CISTPL_CFTABLE_AUDIO' undeclared (first use in this function)
| /home/hrw/zaurus/oe/build/0422/tmp/work/c7x0-linux/cfu1-driver-2.6-r0/sl811_cs.c:261: error: request for member `conf' in something not a structure or union
| /home/hrw/zaurus/oe/build/0422/tmp/work/c7x0-linux/cfu1-driver-2.6-r0/sl811_cs.c:261: error: `CONF_ENABLE_SPKR' undeclared (first use in this function)
| /home/hrw/zaurus/oe/build/0422/tmp/work/c7x0-linux/cfu1-driver-2.6-r0/sl811_cs.c:262: error: request for member `conf' in something not a structure or union
| /home/hrw/zaurus/oe/build/0422/tmp/work/c7x0-linux/cfu1-driver-2.6-r0/sl811_cs.c:262: error: `CCSR_AUDIO_ENA' undeclared (first use in this function)
| /home/hrw/zaurus/oe/build/0422/tmp/work/c7x0-linux/cfu1-driver-2.6-r0/sl811_cs.c:267: error: `CISTPL_POWER_VNOM' undeclared (first use in this function)
| /home/hrw/zaurus/oe/build/0422/tmp/work/c7x0-linux/cfu1-driver-2.6-r0/sl811_cs.c:278: error: request for member `conf' in something not a structure or union
| /home/hrw/zaurus/oe/build/0422/tmp/work/c7x0-linux/cfu1-driver-2.6-r0/sl811_cs.c:278: error: request for member `conf' in something not a structure or union
| /home/hrw/zaurus/oe/build/0422/tmp/work/c7x0-linux/cfu1-driver-2.6-r0/sl811_cs.c:281: error: request for member `conf' in something not a structure or union
| /home/hrw/zaurus/oe/build/0422/tmp/work/c7x0-linux/cfu1-driver-2.6-r0/sl811_cs.c:281: error: request for member `conf' in something not a structure or union
| /home/hrw/zaurus/oe/build/0422/tmp/work/c7x0-linux/cfu1-driver-2.6-r0/sl811_cs.c:286: error: request for member `conf' in something not a structure or union
| /home/hrw/zaurus/oe/build/0422/tmp/work/c7x0-linux/cfu1-driver-2.6-r0/sl811_cs.c:286: error: `CONF_ENABLE_IRQ' undeclared (first use in this function)
| /home/hrw/zaurus/oe/build/0422/tmp/work/c7x0-linux/cfu1-driver-2.6-r0/sl811_cs.c:289: error: request for member `io' in something not a structure or union
| /home/hrw/zaurus/oe/build/0422/tmp/work/c7x0-linux/cfu1-driver-2.6-r0/sl811_cs.c:289: error: request for member `io' in something not a structure or union
| /home/hrw/zaurus/oe/build/0422/tmp/work/c7x0-linux/cfu1-driver-2.6-r0/sl811_cs.c:291: error: `cistpl_io_t' undeclared (first use in this function)
| /home/hrw/zaurus/oe/build/0422/tmp/work/c7x0-linux/cfu1-driver-2.6-r0/sl811_cs.c:291: error: `io' undeclared (first use in this function)
| /home/hrw/zaurus/oe/build/0422/tmp/work/c7x0-linux/cfu1-driver-2.6-r0/sl811_cs.c:293: error: request for member `io' in something not a structure or union
| /home/hrw/zaurus/oe/build/0422/tmp/work/c7x0-linux/cfu1-driver-2.6-r0/sl811_cs.c:293: error: `IO_DATA_PATH_WIDTH_8' undeclared (first use in this function)
| /home/hrw/zaurus/oe/build/0422/tmp/work/c7x0-linux/cfu1-driver-2.6-r0/sl811_cs.c:294: error: request for member `io' in something not a structure or union
| /home/hrw/zaurus/oe/build/0422/tmp/work/c7x0-linux/cfu1-driver-2.6-r0/sl811_cs.c:294: error: `CISTPL_IO_LINES_MASK' undeclared (first use in this function)
| /home/hrw/zaurus/oe/build/0422/tmp/work/c7x0-linux/cfu1-driver-2.6-r0/sl811_cs.c:295: error: request for member `io' in something not a structure or union
| /home/hrw/zaurus/oe/build/0422/tmp/work/c7x0-linux/cfu1-driver-2.6-r0/sl811_cs.c:296: error: request for member `io' in something not a structure or union
| /home/hrw/zaurus/oe/build/0422/tmp/work/c7x0-linux/cfu1-driver-2.6-r0/sl811_cs.c:298: error: request for member `handle' in something not a structure or union
| /home/hrw/zaurus/oe/build/0422/tmp/work/c7x0-linux/cfu1-driver-2.6-r0/sl811_cs.c:298: error: request for member `io' in something not a structure or union
| /home/hrw/zaurus/oe/build/0422/tmp/work/c7x0-linux/cfu1-driver-2.6-r0/sl811_cs.c:304: error: request for member `io' in something not a structure or union
| /home/hrw/zaurus/oe/build/0422/tmp/work/c7x0-linux/cfu1-driver-2.6-r0/sl811_cs.c:305: error: request for member `handle' in something not a structure or union
| /home/hrw/zaurus/oe/build/0422/tmp/work/c7x0-linux/cfu1-driver-2.6-r0/sl811_cs.c:305: error: request for member `io' in something not a structure or union
| /home/hrw/zaurus/oe/build/0422/tmp/work/c7x0-linux/cfu1-driver-2.6-r0/sl811_cs.c:309: error: request for member `conf' in something not a structure or union
| /home/hrw/zaurus/oe/build/0422/tmp/work/c7x0-linux/cfu1-driver-2.6-r0/sl811_cs.c:310: error: `RequestIRQ' undeclared (first use in this function)
| /home/hrw/zaurus/oe/build/0422/tmp/work/c7x0-linux/cfu1-driver-2.6-r0/sl811_cs.c:310: error: request for member `handle' in something not a structure or union
| /home/hrw/zaurus/oe/build/0422/tmp/work/c7x0-linux/cfu1-driver-2.6-r0/sl811_cs.c:310: error: request for member `irq' in something not a structure or union
| /home/hrw/zaurus/oe/build/0422/tmp/work/c7x0-linux/cfu1-driver-2.6-r0/sl811_cs.c:312: error: `RequestConfiguration' undeclared (first use in this function)
| /home/hrw/zaurus/oe/build/0422/tmp/work/c7x0-linux/cfu1-driver-2.6-r0/sl811_cs.c:312: error: request for member `handle' in something not a structure or union
| /home/hrw/zaurus/oe/build/0422/tmp/work/c7x0-linux/cfu1-driver-2.6-r0/sl811_cs.c:312: error: request for member `conf' in something not a structure or union
| /home/hrw/zaurus/oe/build/0422/tmp/work/c7x0-linux/cfu1-driver-2.6-r0/sl811_cs.c:315: error: request for member `io' in something not a structure or union
| /home/hrw/zaurus/oe/build/0422/tmp/work/c7x0-linux/cfu1-driver-2.6-r0/sl811_cs.c:316: error: request for member `io' in something not a structure or union
| /home/hrw/zaurus/oe/build/0422/tmp/work/c7x0-linux/cfu1-driver-2.6-r0/sl811_cs.c:316: error: request for member `io' in something not a structure or union
| /home/hrw/zaurus/oe/build/0422/tmp/work/c7x0-linux/cfu1-driver-2.6-r0/sl811_cs.c:321: error: request for member `dev' in something not a structure or union
| /home/hrw/zaurus/oe/build/0422/tmp/work/c7x0-linux/cfu1-driver-2.6-r0/sl811_cs.c:323: error: `KERN_INFO' undeclared (first use in this function)
| /home/hrw/zaurus/oe/build/0422/tmp/work/c7x0-linux/cfu1-driver-2.6-r0/sl811_cs.c:323: error: parse error before string constant
| /home/hrw/zaurus/oe/build/0422/tmp/work/c7x0-linux/cfu1-driver-2.6-r0/sl811_cs.c:326: error: request for member `conf' in something not a structure or union
| /home/hrw/zaurus/oe/build/0422/tmp/work/c7x0-linux/cfu1-driver-2.6-r0/sl811_cs.c:327: error: request for member `conf' in something not a structure or union
| /home/hrw/zaurus/oe/build/0422/tmp/work/c7x0-linux/cfu1-driver-2.6-r0/sl811_cs.c:327: error: request for member `conf' in something not a structure or union
| /home/hrw/zaurus/oe/build/0422/tmp/work/c7x0-linux/cfu1-driver-2.6-r0/sl811_cs.c:328: error: request for member `conf' in something not a structure or union
| /home/hrw/zaurus/oe/build/0422/tmp/work/c7x0-linux/cfu1-driver-2.6-r0/sl811_cs.c:329: error: request for member `irq' in something not a structure or union
| /home/hrw/zaurus/oe/build/0422/tmp/work/c7x0-linux/cfu1-driver-2.6-r0/sl811_cs.c:330: error: request for member `irq' in something not a structure or union
| /home/hrw/zaurus/oe/build/0422/tmp/work/c7x0-linux/cfu1-driver-2.6-r0/sl811_cs.c:333: error: request for member `io' in something not a structure or union
| /home/hrw/zaurus/oe/build/0422/tmp/work/c7x0-linux/cfu1-driver-2.6-r0/sl811_cs.c:334: error: request for member `io' in something not a structure or union
| /home/hrw/zaurus/oe/build/0422/tmp/work/c7x0-linux/cfu1-driver-2.6-r0/sl811_cs.c:335: error: request for member `io' in something not a structure or union
| /home/hrw/zaurus/oe/build/0422/tmp/work/c7x0-linux/cfu1-driver-2.6-r0/sl811_cs.c:335: error: request for member `io' in something not a structure or union
| /home/hrw/zaurus/oe/build/0422/tmp/work/c7x0-linux/cfu1-driver-2.6-r0/sl811_cs.c:336: error: request for member `io' in something not a structure or union
| /home/hrw/zaurus/oe/build/0422/tmp/work/c7x0-linux/cfu1-driver-2.6-r0/sl811_cs.c:341: error: request for member `state' in something not a structure or union
| /home/hrw/zaurus/oe/build/0422/tmp/work/c7x0-linux/cfu1-driver-2.6-r0/sl811_cs.c:341: error: `DEV_CONFIG_PENDING' undeclared (first use in this function)
| /home/hrw/zaurus/oe/build/0422/tmp/work/c7x0-linux/cfu1-driver-2.6-r0/sl811_cs.c:348: error: request for member `handle' in something not a structure or union
| /home/hrw/zaurus/oe/build/0422/tmp/work/c7x0-linux/cfu1-driver-2.6-r0/sl811_cs.c:350: error: request for member `state' in something not a structure or union
| /home/hrw/zaurus/oe/build/0422/tmp/work/c7x0-linux/cfu1-driver-2.6-r0/sl811_cs.c: At top level:
| /home/hrw/zaurus/oe/build/0422/tmp/work/c7x0-linux/cfu1-driver-2.6-r0/sl811_cs.c:356: error: parse error before '*' token
| /home/hrw/zaurus/oe/build/0422/tmp/work/c7x0-linux/cfu1-driver-2.6-r0/sl811_cs.c: In function `sl811_cs_release':
| /home/hrw/zaurus/oe/build/0422/tmp/work/c7x0-linux/cfu1-driver-2.6-r0/sl811_cs.c:361: error: request for member `open' in something not a structure or union
| /home/hrw/zaurus/oe/build/0422/tmp/work/c7x0-linux/cfu1-driver-2.6-r0/sl811_cs.c:364: error: request for member `state' in something not a structure or union
| /home/hrw/zaurus/oe/build/0422/tmp/work/c7x0-linux/cfu1-driver-2.6-r0/sl811_cs.c:364: error: `DEV_STALE_CONFIG' undeclared (first use in this function)
| /home/hrw/zaurus/oe/build/0422/tmp/work/c7x0-linux/cfu1-driver-2.6-r0/sl811_cs.c:369: error: request for member `dev' in something not a structure or union
| /home/hrw/zaurus/oe/build/0422/tmp/work/c7x0-linux/cfu1-driver-2.6-r0/sl811_cs.c:371: error: request for member `handle' in something not a structure or union
| /home/hrw/zaurus/oe/build/0422/tmp/work/c7x0-linux/cfu1-driver-2.6-r0/sl811_cs.c:372: error: request for member `io' in something not a structure or union
| /home/hrw/zaurus/oe/build/0422/tmp/work/c7x0-linux/cfu1-driver-2.6-r0/sl811_cs.c:373: error: request for member `handle' in something not a structure or union
| /home/hrw/zaurus/oe/build/0422/tmp/work/c7x0-linux/cfu1-driver-2.6-r0/sl811_cs.c:373: error: request for member `io' in something not a structure or union
| /home/hrw/zaurus/oe/build/0422/tmp/work/c7x0-linux/cfu1-driver-2.6-r0/sl811_cs.c:374: error: request for member `irq' in something not a structure or union
| /home/hrw/zaurus/oe/build/0422/tmp/work/c7x0-linux/cfu1-driver-2.6-r0/sl811_cs.c:375: error: request for member `handle' in something not a structure or union
| /home/hrw/zaurus/oe/build/0422/tmp/work/c7x0-linux/cfu1-driver-2.6-r0/sl811_cs.c:375: error: request for member `irq' in something not a structure or union
| /home/hrw/zaurus/oe/build/0422/tmp/work/c7x0-linux/cfu1-driver-2.6-r0/sl811_cs.c:376: error: request for member `state' in something not a structure or union
| /home/hrw/zaurus/oe/build/0422/tmp/work/c7x0-linux/cfu1-driver-2.6-r0/sl811_cs.c:376: error: `DEV_CONFIG' undeclared (first use in this function)
| /home/hrw/zaurus/oe/build/0422/tmp/work/c7x0-linux/cfu1-driver-2.6-r0/sl811_cs.c:378: error: request for member `state' in something not a structure or union
| /home/hrw/zaurus/oe/build/0422/tmp/work/c7x0-linux/cfu1-driver-2.6-r0/sl811_cs.c:378: error: `DEV_STALE_LINK' undeclared (first use in this function)
| /home/hrw/zaurus/oe/build/0422/tmp/work/c7x0-linux/cfu1-driver-2.6-r0/sl811_cs.c: At top level:
| /home/hrw/zaurus/oe/build/0422/tmp/work/c7x0-linux/cfu1-driver-2.6-r0/sl811_cs.c:387: error: parse error before "event"
| /home/hrw/zaurus/oe/build/0422/tmp/work/c7x0-linux/cfu1-driver-2.6-r0/sl811_cs.c: In function `sl811_cs_event':
| /home/hrw/zaurus/oe/build/0422/tmp/work/c7x0-linux/cfu1-driver-2.6-r0/sl811_cs.c:389: error: `dev_link_t' undeclared (first use in this function)
| /home/hrw/zaurus/oe/build/0422/tmp/work/c7x0-linux/cfu1-driver-2.6-r0/sl811_cs.c:389: error: `args' undeclared (first use in this function)
| /home/hrw/zaurus/oe/build/0422/tmp/work/c7x0-linux/cfu1-driver-2.6-r0/sl811_cs.c:393: error: `event' undeclared (first use in this function)
| /home/hrw/zaurus/oe/build/0422/tmp/work/c7x0-linux/cfu1-driver-2.6-r0/sl811_cs.c:394: error: `CS_EVENT_CARD_REMOVAL' undeclared (first use in this function)
| /home/hrw/zaurus/oe/build/0422/tmp/work/c7x0-linux/cfu1-driver-2.6-r0/sl811_cs.c:395: error: request for member `state' in something not a structure or union
| /home/hrw/zaurus/oe/build/0422/tmp/work/c7x0-linux/cfu1-driver-2.6-r0/sl811_cs.c:395: error: `DEV_PRESENT' undeclared (first use in this function)
| /home/hrw/zaurus/oe/build/0422/tmp/work/c7x0-linux/cfu1-driver-2.6-r0/sl811_cs.c:396: error: request for member `state' in something not a structure or union
| /home/hrw/zaurus/oe/build/0422/tmp/work/c7x0-linux/cfu1-driver-2.6-r0/sl811_cs.c:396: error: `DEV_CONFIG' undeclared (first use in this function)
| /home/hrw/zaurus/oe/build/0422/tmp/work/c7x0-linux/cfu1-driver-2.6-r0/sl811_cs.c:401: error: `CS_EVENT_CARD_INSERTION' undeclared (first use in this function)
| /home/hrw/zaurus/oe/build/0422/tmp/work/c7x0-linux/cfu1-driver-2.6-r0/sl811_cs.c:402: error: request for member `state' in something not a structure or union
| /home/hrw/zaurus/oe/build/0422/tmp/work/c7x0-linux/cfu1-driver-2.6-r0/sl811_cs.c:402: error: `DEV_CONFIG_PENDING' undeclared (first use in this function)
| /home/hrw/zaurus/oe/build/0422/tmp/work/c7x0-linux/cfu1-driver-2.6-r0/sl811_cs.c:406: error: `CS_EVENT_PM_SUSPEND' undeclared (first use in this function)
| /home/hrw/zaurus/oe/build/0422/tmp/work/c7x0-linux/cfu1-driver-2.6-r0/sl811_cs.c:407: error: request for member `state' in something not a structure or union
| /home/hrw/zaurus/oe/build/0422/tmp/work/c7x0-linux/cfu1-driver-2.6-r0/sl811_cs.c:407: error: `DEV_SUSPEND' undeclared (first use in this function)
| /home/hrw/zaurus/oe/build/0422/tmp/work/c7x0-linux/cfu1-driver-2.6-r0/sl811_cs.c:409: error: `CS_EVENT_RESET_PHYSICAL' undeclared (first use in this function)
| /home/hrw/zaurus/oe/build/0422/tmp/work/c7x0-linux/cfu1-driver-2.6-r0/sl811_cs.c:410: error: request for member `state' in something not a structure or union
| /home/hrw/zaurus/oe/build/0422/tmp/work/c7x0-linux/cfu1-driver-2.6-r0/sl811_cs.c:411: error: request for member `handle' in something not a structure or union
| /home/hrw/zaurus/oe/build/0422/tmp/work/c7x0-linux/cfu1-driver-2.6-r0/sl811_cs.c:413: error: `CS_EVENT_PM_RESUME' undeclared (first use in this function)
| /home/hrw/zaurus/oe/build/0422/tmp/work/c7x0-linux/cfu1-driver-2.6-r0/sl811_cs.c:414: error: request for member `state' in something not a structure or union
| /home/hrw/zaurus/oe/build/0422/tmp/work/c7x0-linux/cfu1-driver-2.6-r0/sl811_cs.c:416: error: `CS_EVENT_CARD_RESET' undeclared (first use in this function)
| /home/hrw/zaurus/oe/build/0422/tmp/work/c7x0-linux/cfu1-driver-2.6-r0/sl811_cs.c:417: error: request for member `state' in something not a structure or union
| /home/hrw/zaurus/oe/build/0422/tmp/work/c7x0-linux/cfu1-driver-2.6-r0/sl811_cs.c:418: error: request for member `handle' in something not a structure or union
| /home/hrw/zaurus/oe/build/0422/tmp/work/c7x0-linux/cfu1-driver-2.6-r0/sl811_cs.c:418: error: request for member `conf' in something not a structure or union
| /home/hrw/zaurus/oe/build/0422/tmp/work/c7x0-linux/cfu1-driver-2.6-r0/sl811_cs.c: At top level:
| /home/hrw/zaurus/oe/build/0422/tmp/work/c7x0-linux/cfu1-driver-2.6-r0/sl811_cs.c:91: error: storage size of `sl811_driver' isn't known
| make[1]: *** [/home/hrw/zaurus/oe/build/0422/tmp/work/c7x0-linux/cfu1-driver-2.6-r0/sl811_cs.o] Error 1
| make[1]: Leaving directory `/home/hrw/zaurus/oe/build/0422/tmp/work/c7x0-linux/linux-openzaurus-2.6.11-r16/linux-2.6.11'
| make: *** [_module_/home/hrw/zaurus/oe/build/0422/tmp/work/c7x0-linux/cfu1-driver-2.6-r0] Error 2
| make: Leaving directory `/home/hrw/zaurus/oe/build/0422/tmp/work/c7x0-linux/linux-openzaurus-2.6.11-r16/linux-2.6.11'
| FATAL: oe_runmake failed
NOTE:[13:48] Task failed:
NOTE:[13:48] package cfu1-driver-2.6-r0: task do_compile: failed
ERROR: TaskFailed event exception, aborting
NOTE:[13:48] package cfu1-driver-2.6: failed
Build statistics:
Attempted builds: 1
Failed builds: 1