All pastes #10292 Raw Edit

Carp

public text v1 · immutable
#10292 ·published 2005-04-25 19:52 UTC
rendered paste body
zaptel.c:5721: error: dereferencing pointer to incomplete type
zaptel.c:5722: error: dereferencing pointer to incomplete type
zaptel.c:5728: error: dereferencing pointer to incomplete type
zaptel.c:5728: error: dereferencing pointer to incomplete type
zaptel.c:5729: error: dereferencing pointer to incomplete type
zaptel.c:5754: error: dereferencing pointer to incomplete type
zaptel.c:5754: error: dereferencing pointer to incomplete type
zaptel.c:5756: error: dereferencing pointer to incomplete type
zaptel.c: In function `process_timers':
zaptel.c:5806: warning: assignment from incompatible pointer type
zaptel.c:5808: error: dereferencing pointer to incomplete type
zaptel.c:5809: error: dereferencing pointer to incomplete type
zaptel.c:5810: error: dereferencing pointer to incomplete type
zaptel.c:5811: error: dereferencing pointer to incomplete type
zaptel.c:5812: error: dereferencing pointer to incomplete type
zaptel.c:5812: error: dereferencing pointer to incomplete type
zaptel.c:5813: error: dereferencing pointer to incomplete type
zaptel.c:5816: error: dereferencing pointer to incomplete type
zaptel.c: In function `zt_timer_poll':
zaptel.c:5823: error: dereferencing pointer to incomplete type
zaptel.c:5827: warning: implicit declaration of function `poll_wait'
zaptel.c:5827: error: dereferencing pointer to incomplete type
zaptel.c:5829: error: dereferencing pointer to incomplete type
zaptel.c:5829: error: dereferencing pointer to incomplete type
zaptel.c: In function `zt_chan_poll':
zaptel.c:5848: error: dereferencing pointer to incomplete type
zaptel.c:5850: error: dereferencing pointer to incomplete type
zaptel.c:5852: error: dereferencing pointer to incomplete type
zaptel.c:5855: error: dereferencing pointer to incomplete type
zaptel.c:5855: error: dereferencing pointer to incomplete type
zaptel.c:5858: error: dereferencing pointer to incomplete type
zaptel.c:5858: error: dereferencing pointer to incomplete type
zaptel.c:5863: error: dereferencing pointer to incomplete type
zaptel.c: In function `zt_poll':
zaptel.c:5871: error: dereferencing pointer to incomplete type
zaptel.c:5881: error: dereferencing pointer to incomplete type
zaptel.c:5884: error: dereferencing pointer to incomplete type
zaptel.c:5887: error: dereferencing pointer to incomplete type
zaptel.c:5892: error: dereferencing pointer to incomplete type
zaptel.c: In function `__zt_transmit_chunk':
zaptel.c:5905: error: dereferencing pointer to incomplete type
zaptel.c:5905: error: dereferencing pointer to incomplete type
zaptel.c: In function `__zt_real_transmit':
zaptel.c:5919: error: dereferencing pointer to incomplete type
zaptel.c:5921: error: dereferencing pointer to incomplete type
zaptel.c:5921: error: dereferencing pointer to incomplete type
zaptel.c:5923: error: dereferencing pointer to incomplete type
zaptel.c: In function `__zt_getempty':
zaptel.c:5938: error: dereferencing pointer to incomplete type
zaptel.c:5939: error: dereferencing pointer to incomplete type
zaptel.c:5939: error: dereferencing pointer to incomplete type
zaptel.c:5944: error: dereferencing pointer to incomplete type
zaptel.c:5944: error: dereferencing pointer to incomplete type
zaptel.c:5945: error: dereferencing pointer to incomplete type
zaptel.c:5947: error: dereferencing pointer to incomplete type
zaptel.c:5949: error: dereferencing pointer to incomplete type
zaptel.c:5949: error: dereferencing pointer to incomplete type
zaptel.c:5952: error: dereferencing pointer to incomplete type
zaptel.c:5953: error: dereferencing pointer to incomplete type
zaptel.c:5954: error: dereferencing pointer to incomplete type
zaptel.c:5954: error: dereferencing pointer to incomplete type
zaptel.c:5955: error: dereferencing pointer to incomplete type
zaptel.c:5957: error: dereferencing pointer to incomplete type
zaptel.c:5960: error: dereferencing pointer to incomplete type
zaptel.c:5961: error: dereferencing pointer to incomplete type
zaptel.c:5961: error: dereferencing pointer to incomplete type
zaptel.c:5966: error: dereferencing pointer to incomplete type
zaptel.c: In function `__zt_receive_chunk':
zaptel.c:5979: error: dereferencing pointer to incomplete type
zaptel.c:5982: error: dereferencing pointer to incomplete type
zaptel.c:5982: error: dereferencing pointer to incomplete type
zaptel.c: In function `__zt_real_receive':
zaptel.c:5997: error: dereferencing pointer to incomplete type
zaptel.c:5999: error: dereferencing pointer to incomplete type
zaptel.c:5999: error: dereferencing pointer to incomplete type
zaptel.c:6001: error: dereferencing pointer to incomplete type
zaptel.c: In function `zt_transmit':
zaptel.c:6011: error: dereferencing pointer to incomplete type
zaptel.c:6012: error: dereferencing pointer to incomplete type
zaptel.c:6013: error: dereferencing pointer to incomplete type
zaptel.c:6013: error: dereferencing pointer to incomplete type
zaptel.c:6014: error: dereferencing pointer to incomplete type
zaptel.c:6015: error: dereferencing pointer to incomplete type
zaptel.c:6016: error: dereferencing pointer to incomplete type
zaptel.c:6017: error: dereferencing pointer to incomplete type
zaptel.c:6020: error: dereferencing pointer to incomplete type
zaptel.c:6021: error: dereferencing pointer to incomplete type
zaptel.c:6023: error: dereferencing pointer to incomplete type
zaptel.c:6033: error: dereferencing pointer to incomplete type
zaptel.c:6036: error: dereferencing pointer to incomplete type
zaptel.c:6037: error: dereferencing pointer to incomplete type
zaptel.c:6042: error: dereferencing pointer to incomplete type
zaptel.c:6045: error: dereferencing pointer to incomplete type
zaptel.c:6046: error: dereferencing pointer to incomplete type
zaptel.c:6048: error: dereferencing pointer to incomplete type
zaptel.c:6048: error: dereferencing pointer to incomplete type
zaptel.c:6049: error: dereferencing pointer to incomplete type
zaptel.c:6049: error: dereferencing pointer to incomplete type
zaptel.c:6050: error: dereferencing pointer to incomplete type
zaptel.c:6050: error: dereferencing pointer to incomplete type
zaptel.c:6050: error: dereferencing pointer to incomplete type
zaptel.c:6056: error: dereferencing pointer to incomplete type
zaptel.c:6058: error: dereferencing pointer to incomplete type
zaptel.c:6059: error: dereferencing pointer to incomplete type
zaptel.c:6060: error: dereferencing pointer to incomplete type
zaptel.c:6061: error: dereferencing pointer to incomplete type
zaptel.c:6062: error: dereferencing pointer to incomplete type
zaptel.c:6063: error: dereferencing pointer to incomplete type
zaptel.c:6064: error: dereferencing pointer to incomplete type
zaptel.c:6065: error: dereferencing pointer to incomplete type
zaptel.c: In function `zt_receive':
zaptel.c:6081: error: dereferencing pointer to incomplete type
zaptel.c:6082: error: dereferencing pointer to incomplete type
zaptel.c:6082: error: dereferencing pointer to incomplete type
zaptel.c:6083: error: dereferencing pointer to incomplete type
zaptel.c:6084: error: dereferencing pointer to incomplete type
zaptel.c:6092: error: dereferencing pointer to incomplete type
zaptel.c:6094: error: dereferencing pointer to incomplete type
zaptel.c:6097: error: dereferencing pointer to incomplete type
zaptel.c:6102: error: dereferencing pointer to incomplete type
zaptel.c:6104: error: dereferencing pointer to incomplete type
zaptel.c:6105: error: dereferencing pointer to incomplete type
zaptel.c:6106: error: dereferencing pointer to incomplete type
zaptel.c:6107: error: dereferencing pointer to incomplete type
zaptel.c:6110: error: dereferencing pointer to incomplete type
zaptel.c:6111: error: dereferencing pointer to incomplete type
zaptel.c:6112: error: dereferencing pointer to incomplete type
zaptel.c:6113: error: dereferencing pointer to incomplete type
zaptel.c:6114: error: dereferencing pointer to incomplete type
zaptel.c:6115: error: dereferencing pointer to incomplete type
zaptel.c:6116: error: dereferencing pointer to incomplete type
zaptel.c:6118: error: dereferencing pointer to incomplete type
zaptel.c:6118: error: dereferencing pointer to incomplete type
zaptel.c:6119: error: dereferencing pointer to incomplete type
zaptel.c:6122: error: dereferencing pointer to incomplete type
zaptel.c:6124: error: dereferencing pointer to incomplete type
zaptel.c:6125: error: dereferencing pointer to incomplete type
zaptel.c:6127: error: dereferencing pointer to incomplete type
zaptel.c:6129: error: dereferencing pointer to incomplete type
zaptel.c:6132: error: dereferencing pointer to incomplete type
zaptel.c:6133: error: dereferencing pointer to incomplete type
zaptel.c:6134: error: dereferencing pointer to incomplete type
zaptel.c:6135: error: dereferencing pointer to incomplete type
zaptel.c:6136: error: dereferencing pointer to incomplete type
zaptel.c:6137: error: dereferencing pointer to incomplete type
zaptel.c:6138: error: dereferencing pointer to incomplete type
zaptel.c:6139: error: dereferencing pointer to incomplete type
zaptel.c:6141: error: dereferencing pointer to incomplete type
zaptel.c:6142: error: dereferencing pointer to incomplete type
zaptel.c:6144: error: dereferencing pointer to incomplete type
zaptel.c:6148: error: dereferencing pointer to incomplete type
zaptel.c:6163: error: dereferencing pointer to incomplete type
zaptel.c:6163: error: dereferencing pointer to incomplete type
zaptel.c:6165: error: dereferencing pointer to incomplete type
zaptel.c:6166: error: dereferencing pointer to incomplete type
zaptel.c:6169: error: dereferencing pointer to incomplete type
zaptel.c:6170: error: dereferencing pointer to incomplete type
zaptel.c:6177: error: dereferencing pointer to incomplete type
zaptel.c:6178: error: dereferencing pointer to incomplete type
zaptel.c:6180: error: dereferencing pointer to incomplete type
zaptel.c:6201: error: dereferencing pointer to incomplete type
zaptel.c:6203: error: dereferencing pointer to incomplete type
zaptel.c:6206: error: dereferencing pointer to incomplete type
zaptel.c:6210: error: dereferencing pointer to incomplete type
zaptel.c:6210: error: dereferencing pointer to incomplete type
zaptel.c:6212: error: dereferencing pointer to incomplete type
zaptel.c:6213: error: dereferencing pointer to incomplete type
zaptel.c:6216: error: dereferencing pointer to incomplete type
zaptel.c:6217: error: dereferencing pointer to incomplete type
zaptel.c: At top level:
zaptel.c:6240: error: variable `zt_fops' has initializer but incomplete type
zaptel.c:6241: error: unknown field `owner' specified in initializer
zaptel.c:6241: warning: excess elements in struct initializer
zaptel.c:6241: warning: (near initialization for `zt_fops')
zaptel.c:6242: error: unknown field `llseek' specified in initializer
zaptel.c:6242: warning: excess elements in struct initializer
zaptel.c:6242: warning: (near initialization for `zt_fops')
zaptel.c:6243: error: unknown field `open' specified in initializer
zaptel.c:6243: warning: excess elements in struct initializer
zaptel.c:6243: warning: (near initialization for `zt_fops')
zaptel.c:6244: error: unknown field `release' specified in initializer
zaptel.c:6244: warning: excess elements in struct initializer
zaptel.c:6244: warning: (near initialization for `zt_fops')
zaptel.c:6245: error: unknown field `ioctl' specified in initializer
zaptel.c:6245: warning: excess elements in struct initializer
zaptel.c:6245: warning: (near initialization for `zt_fops')
zaptel.c:6246: error: unknown field `read' specified in initializer
zaptel.c:6246: warning: excess elements in struct initializer
zaptel.c:6246: warning: (near initialization for `zt_fops')
zaptel.c:6247: error: unknown field `write' specified in initializer
zaptel.c:6247: warning: excess elements in struct initializer
zaptel.c:6247: warning: (near initialization for `zt_fops')
zaptel.c:6248: error: unknown field `poll' specified in initializer
zaptel.c:6248: warning: excess elements in struct initializer
zaptel.c:6248: warning: (near initialization for `zt_fops')
zaptel.c:6249: error: unknown field `mmap' specified in initializer
zaptel.c:6249: warning: excess elements in struct initializer
zaptel.c:6249: warning: (near initialization for `zt_fops')
zaptel.c:6250: error: unknown field `flush' specified in initializer
zaptel.c:6250: warning: excess elements in struct initializer
zaptel.c:6250: warning: (near initialization for `zt_fops')
zaptel.c:6251: error: unknown field `fsync' specified in initializer
zaptel.c:6251: warning: excess elements in struct initializer
zaptel.c:6251: warning: (near initialization for `zt_fops')
zaptel.c:6252: error: unknown field `fasync' specified in initializer
zaptel.c:6252: warning: excess elements in struct initializer
zaptel.c:6252: warning: (near initialization for `zt_fops')
zaptel.c: In function `zt_init':
zaptel.c:6342: warning: implicit declaration of function `register_chrdev'
zaptel.c:6343: error: `KERN_ERR' undeclared (first use in this function)
zaptel.c:6343: error: syntax error before string constant
zaptel.c:6348: error: `KERN_INFO' undeclared (first use in this function)
zaptel.c:6348: error: syntax error before string constant
zaptel.c:6353: warning: implicit declaration of function `rwlock_init'
zaptel.c: In function `zt_cleanup':
zaptel.c:6367: error: `KERN_INFO' undeclared (first use in this function)
zaptel.c:6367: error: syntax error before string constant
zaptel.c:6386: warning: implicit declaration of function `unregister_chrdev'
zaptel.c: At top level:
zaptel.c:6240: error: storage size of `zt_fops' isn't known
/usr/include/linux/proc_fs.h:193: warning: `create_proc_read_entry' declared `static' but never defined
make: *** [zaptel.o] Error 1
[root@VOICE zaptel]#