All pastes #102451 Raw Edit

Chronos

public text v1 · immutable
#102451 ·published 2006-07-27 16:32 UTC
rendered paste body
Writing ix01.html for index
Writing ix02.html for index
Writing ix03.html for index
Writing ix04.html for index
I/O error : Permission denied
runtime error: file file:///usr/share/sgml/docbook/xsl-stylesheets-1.68.1/html/chunker.xsl line 192 element document
xsltDocumentElem: unable to save to ix04.html
Writing ix05.html for index
I/O error : Permission denied
runtime error: file file:///usr/share/sgml/docbook/xsl-stylesheets-1.68.1/html/chunker.xsl line 192 element document
xsltDocumentElem: unable to save to ix05.html
Writing ix06.html for index
I/O error : Permission denied
runtime error: file file:///usr/share/sgml/docbook/xsl-stylesheets-1.68.1/html/chunker.xsl line 192 element document
xsltDocumentElem: unable to save to ix06.html
Writing index.html for book(index)
I/O error : Permission denied
runtime error: file file:///usr/share/sgml/docbook/xsl-stylesheets-1.68.1/html/chunker.xsl line 192 element document
xsltDocumentElem: unable to save to index.html
Writing index.sgml for book(index)
I/O error : Permission denied
runtime error: file file:///usr/share/sgml/docbook/xsl-stylesheets-1.68.1/html/chunker.xsl line 215 element document
xsltDocumentElem: unable to save to index.sgml
Writing gtk.devhelp for book(index)
I/O error : Permission denied
runtime error: file file:///usr/share/sgml/docbook/xsl-stylesheets-1.68.1/html/chunker.xsl line 192 element document
xsltDocumentElem: unable to save to gtk.devhelp
Writing gtk.devhelp2 for book(index)
I/O error : Permission denied
runtime error: file file:///usr/share/sgml/docbook/xsl-stylesheets-1.68.1/html/chunker.xsl line 192 element document
xsltDocumentElem: unable to save to gtk.devhelp2
no result for ../gtk-docs.sgml
make[4]: *** [html-build.stamp] Error 9
make[4]: Leaving directory `/var/tmp/portage/gtk+-2.8.19/work/gtk+-2.8.19/docs/reference/gtk'
make[3]: *** [all-recursive] Error 1
make[3]: Leaving directory `/var/tmp/portage/gtk+-2.8.19/work/gtk+-2.8.19/docs/reference'
make[2]: *** [all-recursive] Error 1
make[2]: Leaving directory `/var/tmp/portage/gtk+-2.8.19/work/gtk+-2.8.19/docs'
make[1]: *** [all-recursive] Error 1
make[1]: Leaving directory `/var/tmp/portage/gtk+-2.8.19/work/gtk+-2.8.19'
make: *** [all] Error 2

!!! ERROR: x11-libs/gtk+-2.8.19 failed.
Call stack:
  ebuild.sh, line 1539:   Called dyn_compile
  ebuild.sh, line 939:   Called src_compile
  gtk+-2.8.19.ebuild, line 116:   Called die

!!! gtk+ failed to compile
!!! If you need support, post the topmost build error, and the call stack if relevant.