All pastes #101356 Raw Edit

CEGUI build errors

public text v1 · immutable
#101356 ·published 2006-07-26 20:29 UTC
rendered paste body
g++ -DHAVE_CONFIG_H -I. -I. -I../include -I../include -I.. -I/usr/include/freetype2 -g -O2 -MT CEGUIFreeTypeFont.lo -MD -MP -MF .deps/CEGUIFreeTypeFont.Tpo -c CEGUIFreeTypeFont.cpp  -fPIC -DPIC -o .libs/CEGUIFreeTypeFont.o
CEGUIFreeTypeFont.cpp: In member function `virtual void CEGUI::FreeTypeFont::rasterize(CEGUI::utf32, CEGUI::utf32)':
CEGUIFreeTypeFont.cpp:248: error: expected primary-expression before '<<' token
CEGUIFreeTypeFont.cpp:248: error: expected primary-expression before '<<' token
CEGUIFreeTypeFont.cpp:248: error: expected primary-expression before '<<' token
CEGUIFreeTypeFont.cpp:248: error: expected primary-expression before '<' token
CEGUIFreeTypeFont.cpp:248: error: expected primary-expression before '.' token
CEGUIFreeTypeFont.cpp:249: error: expected `;' before "goto"
CEGUIFreeTypeFont.cpp:250: error: expected primary-expression before '==' token
CEGUIFreeTypeFont.cpp:250: error: expected primary-expression before '==' token
CEGUIFreeTypeFont.cpp:250: error: expected primary-expression before '==' token
CEGUIFreeTypeFont.cpp:250: error: expected primary-expression before '=' token
CEGUIFreeTypeFont.cpp:251: error: expected primary-expression before '>>' token
CEGUIFreeTypeFont.cpp:251: error: expected primary-expression before '>>' token
CEGUIFreeTypeFont.cpp:251: error: expected primary-expression before '>>' token
CEGUIFreeTypeFont.cpp:251: error: expected primary-expression before '>' token
CEGUIFreeTypeFont.cpp:251: error: expected primary-expression before '.' token
CEGUIFreeTypeFont.cpp:252: error: expected `;' before '}' token
make[1]: *** [CEGUIFreeTypeFont.lo] Error 1
make[1]: Leaving directory `/home/whitelynx/development/cegui_mk2/src'
make: *** [all-recursive] Error 1