All pastes #1008782 Raw Edit

clueless

public text v1 · immutable
#1008782 ·published 2008-05-05 23:05 UTC
rendered paste body
>>> Unpacking source... * git update start --> *    repository: git://git.jyujin.de/einit/cfg.git  [snip] *    local clone: /usr/portage/distfiles/git-src/einit-cfg *    committish: master>>> Unpacked to /var/tmp/portage/sys-apps/einit-cfg-9999/work/einit-cfg-9999>>> Source unpacked.>>> Compiling source in /var/tmp/portage/sys-apps/einit-cfg-9999/work/einit-cfg-9999 ...scons: Reading SConscript files ...scons: done reading SConscript files.scons: Building targets ...gcc -o bin/bin-einit-cfg/cli/auto.o -c --std=c99 -Wall -DRELEASE_BUILD -march=native -O2 -pipe -fomit-frame-pointer -Iinclude bin/bin-einit-cfg/cli/auto.cgcc -o bin/bin-einit-cfg/cli/cli.o -c --std=c99 -Wall -DRELEASE_BUILD -march=native -O2 -pipe -fomit-frame-pointer -Iinclude bin/bin-einit-cfg/cli/cli.cbin/bin-einit-cfg/cli/auto.c:1:26: error: include/auto.h: No such file or directorybin/bin-einit-cfg/cli/auto.c:4: error: array type has incomplete element typebin/bin-einit-cfg/cli/auto.c:4: warning: 'struct _AutoAlternative' declared inside parameter listbin/bin-einit-cfg/cli/auto.c:4: warning: its scope is only this definition or declaration, which is probably not what you wantbin/bin-einit-cfg/cli/auto.c: In function 'expecting':bin/bin-einit-cfg/cli/auto.c:5: warning: implicit declaration of function 'fputs'bin/bin-einit-cfg/cli/auto.c:5: error: 'stderr' undeclared (first use in this function)bin/bin-einit-cfg/cli/auto.c:5: error: (Each undeclared identifier is reported only oncebin/bin-einit-cfg/cli/auto.c:5: error: for each function it appears in.)bin/bin-einit-cfg/cli/auto.c:7: warning: implicit declaration of function 'fprintf'bin/bin-einit-cfg/cli/auto.c:7: warning: incompatible implicit declaration of built-in function 'fprintf'bin/bin-einit-cfg/cli/auto.c: At top level:bin/bin-einit-cfg/cli/auto.c:15: error: array type has incomplete element typebin/bin-einit-cfg/cli/auto.c:15: warning: 'struct _AutoAlternative' declared inside parameter listbin/bin-einit-cfg/cli/auto.c: In function 'autocomplete':bin/bin-einit-cfg/cli/auto.c:19: error: 'stderr' undeclared (first use in this function)bin/bin-einit-cfg/cli/auto.c:20: error: type of formal parameter 1 is incompletebin/bin-einit-cfg/cli/auto.c:26: error: dereferencing pointer to incomplete typebin/bin-einit-cfg/cli/auto.c:27: warning: implicit declaration of function 'strncmp'bin/bin-einit-cfg/cli/auto.c:27: error: dereferencing pointer to incomplete typebin/bin-einit-cfg/cli/auto.c:27: warning: implicit declaration of function 'strlen'bin/bin-einit-cfg/cli/auto.c:27: warning: incompatible implicit declaration of built-in function 'strlen'bin/bin-einit-cfg/cli/auto.c:28: error: dereferencing pointer to incomplete typebin/bin-einit-cfg/cli/auto.c:28: error: dereferencing pointer to incomplete typebin/bin-einit-cfg/cli/auto.c:32: error: increment of pointer to unknown structurebin/bin-einit-cfg/cli/auto.c:32: error: arithmetic on pointer to an incomplete typebin/bin-einit-cfg/cli/auto.c:35: warning: incompatible implicit declaration of built-in function 'fprintf'bin/bin-einit-cfg/cli/auto.c:36: error: type of formal parameter 1 is incompletebin/bin-einit-cfg/cli/auto.c:39:2: warning: no newline at end of filescons: *** [bin/bin-einit-cfg/cli/auto.o] Error 1bin/bin-einit-cfg/cli/cli.c:1:26: error: include/auto.h: No such file or directorybin/bin-einit-cfg/cli/cli.c:2:27: error: include/modes.h: No such file or directorybin/bin-einit-cfg/cli/cli.c:3:26: error: include/help.h: No such file or directorybin/bin-einit-cfg/cli/cli.c:4:25: error: include/cli.h: No such file or directorybin/bin-einit-cfg/cli/cli.c: In function 'cli':bin/bin-einit-cfg/cli/cli.c:9: error: 'AutoAlternative' undeclared (first use in this function)bin/bin-einit-cfg/cli/cli.c:9: error: (Each undeclared identifier is reported only oncebin/bin-einit-cfg/cli/cli.c:9: error: for each function it appears in.)bin/bin-einit-cfg/cli/cli.c:9: error: expected ';' before 'alternatives'bin/bin-einit-cfg/cli/cli.c:17: warning: implicit declaration of function 'autocomplete'bin/bin-einit-cfg/cli/cli.c:17: error: 'alternatives' undeclared (first use in this function)bin/bin-einit-cfg/cli/cli.c:20:2: warning: no newline at end of filescons: *** [bin/bin-einit-cfg/cli/cli.o] Error 1scons: building terminated because of errors. *  * ERROR: sys-apps/einit-cfg-9999 failed. * Call stack: *               ebuild.sh, line   49:  Called src_compile *             environment, line 2715:  Called die * The specific snippet of code: *       scons -f buildscript ${MAKEOPTS:--j2} release=1 || die *  The die message: *   (no error message) *  * If you need support, post the topmost build error, and the call stack if relevant. * A complete build log is located at '/var/tmp/portage/sys-apps/einit-cfg-9999/temp/build.log'. * The ebuild environment file is located at '/var/tmp/portage/sys-apps/einit-cfg-9999/temp/environment'. * This ebuild is from an overlay: '/usr/local/layman/einit/' *