rendered paste bodyte -I/usr/kde/3.5/include -I/usr/qt/3/include -I. -I/usr/kde/3.5/include -DQT_THREAD_SUPPORT -D_REEN
RANT -Wno-long-long -Wundef -ansi -D_XOPEN_SOURCE=500 -D_BSD_SOURCE -Wcast-align -Wconversion -Wchar-subs
ripts -Wall -W -Wpointer-arith -DNDEBUG -DNO_DEBUG -O2 -march=athlon-xp -O2 -pipe -fno-inline -Wformat-sec
rity -Wmissing-format-attribute -Wno-non-virtual-dtor -fno-exceptions -fno-check-new -fno-common -DQT_CLEA
_NAMESPACE -DQT_NO_ASCII_CAST -DQT_NO_STL -DQT_NO_COMPAT -DQT_NO_TRANSLATION -c -o main.o `test -f 'main.
pp' || echo './'`main.cpp
/bin/sh ../../libtool --silent --mode=link --tag=CXX i686-pc-linux-gnu-g++ -Wno-long-long -Wundef -ansi -
_XOPEN_SOURCE=500 -D_BSD_SOURCE -Wcast-align -Wconversion -Wchar-subscripts -Wall -W -Wpointer-arith -DNDE
UG -DNO_DEBUG -O2 -march=athlon-xp -O2 -pipe -fno-inline -Wformat-security -Wmissing-format-attribute -Wno
non-virtual-dtor -fno-exceptions -fno-check-new -fno-common -DQT_CLEAN_NAMESPACE -DQT_NO_ASCII_CAST -DQT_N
_STL -DQT_NO_COMPAT -DQT_NO_TRANSLATION -o amarokapp -L/usr/kde/3.5/lib -L/usr/qt/3/lib -L/usr/lib -
/usr/kde/3.5/lib -R /usr/lib -R /usr/kde/3.5/lib -R /usr/qt/3/lib -R /usr/lib -R /usr/kde/3.5/lib main.o .
/../amarok/src/amarokcore/libamarokcore.la libamarok.la ../../amarok/src/analyzers/libanalyzers.la ../../a
arok/src/plugin/libplugin.la ../../amarok/src/statusbar/libstatusbar.la ../../amarok/src/metadata/libmetad
ta.la -lkutils -lkio -lkdeui -lkdecore -lkhtml -lknewstuff -L/usr/lib -ltag -lGL ../../amarok/src/sqlite/
ibsqlite.la
/usr/kde/3.5/lib/libkhtml.so: undefined reference to `__cxa_get_exception_ptr@CXXABI_1.3.1'
collect2: ld returned 1 exit status
make[4]: *** [amarokapp] Error 1
make[4]: Leaving directory `/var/tmp/portage/amarok-1.4.1-r2/work/amarok-1.4.1/amarok/src'
make[3]: *** [all-recursive] Error 1
make[3]: Leaving directory `/var/tmp/portage/amarok-1.4.1-r2/work/amarok-1.4.1/amarok/src'
make[2]: *** [all-recursive] Error 1
make[2]: Leaving directory `/var/tmp/portage/amarok-1.4.1-r2/work/amarok-1.4.1/amarok'
make[1]: *** [all-recursive] Error 1
make[1]: Leaving directory `/var/tmp/portage/amarok-1.4.1-r2/work/amarok-1.4.1'
make: *** [all] Error 2
!!! ERROR: media-sound/amarok-1.4.1-r2 failed.
Call stack:
ebuild.sh, line 1545: Called dyn_compile
ebuild.sh, line 940: Called src_compile
amarok-1.4.1-r2.ebuild, line 76: Called kde_src_compile
kde.eclass, line 164: Called kde_src_compile 'all'
kde.eclass, line 323: Called kde_src_compile 'myconf' 'configure' 'make'
kde.eclass, line 319: Called die
!!! died running emake, kde_src_compile:make
!!! If you need support, post the topmost build error, and the call stack if relevant.
localhost xgl-coffee #