All pastes #100747 Raw Edit

Miscellany

public text v1 · immutable
#100747 ·published 2006-07-26 12:14 UTC
rendered paste body
        rm -f trackpickerdialogbase.cpp.temp ;\
        if test "$ret" = 0; then echo '#include "tr ackpickerdialogbase.moc"' >> trackpickerdialogbase. cpp; else rm -f trackpickerdialogbase.cpp ; exit $r et ; fi
Session management error: Authentication Rejected, reason : None of the authentication protocols speci fied are supported and host-based authentication fa iled
i686-pc-linux-gnu-g++ -DHAVE_CONFIG_H -I. -I. -I.. -I/usr/kde/3.5/include -I/usr/qt/3/include -I.  -I/ usr/include/taglib  -D_LARGEFILE_SOURCE -D_FILE_OFF SET_BITS=64 -pthread -I/usr/include/gstreamer-0.8 - I/usr/include/glib-2.0 -I/usr/lib/glib-2.0/include -I/usr/include/libxml2     -DQT_THREAD_SUPPORT  -D_ REENTRANT  -Wno-long-long -Wundef -ansi -D_XOPEN_SO URCE=500 -D_BSD_SOURCE -Wcast-align -Wconversion -W char-subscripts -Wall -W -Wpointer-arith -DNDEBUG - DNO_DEBUG -O2 -march=athlon-xp -O2 -pipe -Wformat-s ecurity -Wmissing-format-attribute -Wno-non-virtual -dtor -fno-exceptions -fno-check-new -fno-common -D QT_CLEAN_NAMESPACE -DQT_NO_ASCII_CAST -DQT_NO_STL - DQT_NO_COMPAT -DQT_NO_TRANSLATION -fexceptions -c - o trackpickerdialogbase.o trackpickerdialogbase.cpp
/bin/sh ../libtool --silent --tag=CXX --mode=link i 686-pc-linux-gnu-g++  -Wno-long-long -Wundef -ansi -D_XOPEN_SOURCE=500 -D_BSD_SOURCE -Wcast-align -Wco nversion -Wchar-subscripts -Wall -W -Wpointer-arith  -DNDEBUG -DNO_DEBUG -O2 -march=athlon-xp -O2 -pipe  -Wformat-security -Wmissing-format-attribute -Wno- non-virtual-dtor -fno-exceptions -fno-check-new -fn o-common -DQT_CLEAN_NAMESPACE -DQT_NO_ASCII_CAST -D QT_NO_STL -DQT_NO_COMPAT -DQT_NO_TRANSLATION -fexce ptions   -o juk -L/usr/kde/3.5/lib -L/usr/qt/3/lib -L/usr/lib    -R /usr/kde/3.5/lib -R /usr/kde/3.5/l ib -R /usr/qt/3/lib -R /usr/lib -Wl,--export-dynami c -pthread   advancedsearchdialog.o actioncollectio n.o akodeplayer.o artsplayer.o cache.o categoryread erinterface.o collectionlist.o coverdialog.o coveri conview.o coverinfo.o covermanager.o deletedialog.o  directorylist.o dynamicplaylist.o exampleoptions.o  folderplaylist.o filehandle.o filerenamer.o filere nameroptions.o filerenamerconfigdlg.o gstreamerplay er.o googlefetcher.o googlefetcherdialog.o historyp laylist.o juk.o k3bexporter.o keydialog.o main.o me diafiles.o musicbrainzquery.o nowplaying.o playerma nager.o playlist.o playlistbox.o playlistcollection .o playlistinterface.o playlistitem.o playlistsearc h.o playlistsplitter.o searchplaylist.o searchwidge t.o slideraction.o sortedstringlist.o splashscreen. o statuslabel.o stringshare.o systemtray.o tag.o ta geditor.o tagguesser.o tagguesserconfigdlg.o tagren ameroptions.o tagtransactionmanager.o trackpickerdi alog.o tracksequenceiterator.o tracksequencemanager .o treeviewitemplaylist.o upcomingplaylist.o ktrm.o  viewmode.o jukIface_skel.o coverdialogbase.o delet edialogbase.o directorylistbase.o exampleoptionsbas e.o filerenamerbase.o filerenameroptionsbase.o tagg uesserconfigdlgwidget.o trackpickerdialogbase.o -lm  -lgstreamer-0.8 -lgobject-2.0 -lgmodule-2.0 -ldl - lgthread-2.0 -lxml2 -lz -lm -lglib-2.0   -L/usr/lib     -lkio -L/usr/lib -ltag  -lkhtml
/usr/kde/3.5/lib/libkhtml.so: undefined reference t o `__cxa_get_exception_ptr@CXXABI_1.3.1'
collect2: ld returned 1 exit status
make[3]: *** [juk] Error 1
make[3]: Leaving directory `/var/tmp/portage/kdemul timedia-3.5.3-r1/work/kdemultimedia-3.5.3/juk'
make[2]: *** [all-recursive] Error 1
make[2]: Leaving directory `/var/tmp/portage/kdemul timedia-3.5.3-r1/work/kdemultimedia-3.5.3/juk'
make[1]: *** [all-recursive] Error 1
make[1]: Leaving directory `/var/tmp/portage/kdemul timedia-3.5.3-r1/work/kdemultimedia-3.5.3'
make: *** [all] Error 2

!!! ERROR: kde-base/kdemultimedia-3.5.3-r1 failed.
Call stack:
  ebuild.sh, line 1545:   Called dyn_compile
  ebuild.sh, line 940:   Called src_compile
  kdemultimedia-3.5.3-r1.ebuild, line 85:   Called kde_src_compile
  kde.eclass, line 164:   Called kde_src_compile 'a ll'
  kde.eclass, line 323:   Called kde_src_compile 'm yconf' 'configure' 'make'
  kde.eclass, line 319:   Called die

!!! died running emake, kde_src_compile:make
!!! If you need support, post the topmost build err or, and the call stack if relevant.

localhost ruskie #