http.test
==== http-3.3 http::geturl FAILED
==== Contents of test case:
set token [http::geturl $url]
http::data $token
---- Test generated error; Return code was: 1
---- Return code should have been one of: 0 2
---- errorInfo: couldn't open socket: connection timed out
while executing
"http::geturl $url"
invoked from within
"set token [http::geturl $url]"
("uplevel" body line 2)
invoked from within
"uplevel 1 $script"
---- errorCode: NONE
==== http-3.3 FAILED
==== http-3.4 http::geturl FAILED
==== Contents of test case:
set token [http::geturl $url]
http::data $token
---- Test generated error; Return code was: 1
---- Return code should have been one of: 0 2
---- errorInfo: couldn't open socket: connection timed out
while executing
"http::geturl $url"
invoked from within
"set token [http::geturl $url]"
("uplevel" body line 2)
invoked from within
"uplevel 1 $script"
---- errorCode: NONE
==== http-3.4 FAILED