Part of Slepp's ProjectsPastebinTURLImagebinFilebin
Feedback -- English French German Japanese
Create Upload Newest Tools Donate

Advertising

Unnamed
Saturday, August 18th, 2007 at 3:03:23pm UTC 

  1. * Scan for possible needed slot related rebuilds.
  2.  
  3.  
  4.  
  5.  * Done :), continuing...
  6.  
  7. >>> Unpacking source...
  8. >>> Unpacking digikam-0.9.2.tar.bz2 to /var/tmp/portage/media-gfx/digikam-0.9.2/work
  9.  * Enabling translations for: en
  10. >>> Source unpacked.
  11. >>> Compiling source in /var/tmp/portage/media-gfx/digikam-0.9.2/work/digikam-0.9.2 ...
  12. This Makefile is only for the CVS repository
  13. This will be deleted before making the distribution
  14.  
  15. *** automake (GNU automake) 1.9.6 found.
  16. *** Creating acinclude.m4
  17. *** Creating list of subdirectories
  18. *** Creating Makefile.am
  19. *** Creating configure.files
  20. *** Creating configure.in
  21. *** Creating aclocal.m4
  22. /usr/share/aclocal/soundtouch.m4:29: warning: underquoted definition of AM_PATH_SOUNDTOUCH
  23.   run info '(automake)Extending aclocal'
  24.   or see http://sources.redhat.com/automake/automake.html#Extending-aclocal
  25. /usr/share/aclocal/gtkgl.m4:4: warning: underquoted definition of AM_PATH_GTKGL
  26. /usr/share/aclocal/gpgme3.m4:9: warning: underquoted definition of AM_PATH_GPGME
  27. *** Creating configure
  28. *** Creating config.h template
  29. *** Creating Makefile templates
  30. *** Postprocessing Makefile templates
  31. *** Creating date/time stamp
  32. *** Finished
  33.     Don't forget to run ./configure
  34.     If you haven't done so in a while, run ./configure --help
  35.  * Running elibtoolize in: digikam-0.9.2/admin
  36.  *   Applying portage-1.5.10.patch ...
  37.  *   Applying max_cmd_len-1.5.20.patch ...
  38.  *   Applying sed-1.5.6.patch ...
  39.  * econf: updating digikam-0.9.2/admin/config.guess with /usr/share/gnuconfig/config.guess
  40.  * econf: updating digikam-0.9.2/admin/config.sub with /usr/share/gnuconfig/config.sub
  41. ./configure --prefix=/usr --host=x86_64-pc-linux-gnu --mandir=/usr/share/man --infodir=/usr/share/info --datadir=/usr/share --sysconfdir=/etc --localstatedir=/var/lib --disable-nfs-hack --with-x --enable-mitshm --with-xinerama --with-qt-dir=/usr/qt/3 --enable-mt --with-qt-libraries=/usr/qt/3/lib64 --disable-dependency-tracking --disable-debug --without-debug --enable-final --with-arts --enable-gcc-hidden-visibility --enable-libsuffix=64 --with-extra-includes=/usr/kde/3.5/include --with-extra-libs=/usr/kde/3.5/lib64 --libdir=/usr/lib64 --build=x86_64-pc-linux-gnu
  42. checking build system type... x86_64-pc-linux-gnu
  43. checking host system type... x86_64-pc-linux-gnu
  44. checking target system type... x86_64-pc-linux-gnu
  45. checking for a BSD-compatible install... /usr/bin/install -c
  46. checking for -p flag to install... yes
  47. checking whether build environment is sane... yes
  48. checking for gawk... gawk
  49. checking whether make sets $(MAKE)... yes
  50. checking for kde-config... /usr/kde/3.5/bin/kde-config
  51. checking where to install... /usr (as requested)
  52. checking for style of include used by make... GNU
  53. checking for x86_64-pc-linux-gnu-gcc... x86_64-pc-linux-gnu-gcc
  54. checking for C compiler default output file name... a.out
  55. checking whether the C compiler works... yes
  56. checking whether we are cross compiling... no
  57. checking for suffix of executables...
  58. checking for suffix of object files... o
  59. checking whether we are using the GNU C compiler... yes
  60. checking whether x86_64-pc-linux-gnu-gcc accepts -g... yes
  61. checking for x86_64-pc-linux-gnu-gcc option to accept ISO C89... none needed
  62. checking dependency style of x86_64-pc-linux-gnu-gcc... none
  63. checking how to run the C preprocessor... x86_64-pc-linux-gnu-gcc -E
  64. checking for x86_64-pc-linux-gnu-g++... x86_64-pc-linux-gnu-g++
  65. checking whether we are using the GNU C++ compiler... yes
  66. checking whether x86_64-pc-linux-gnu-g++ accepts -g... yes
  67. checking dependency style of x86_64-pc-linux-gnu-g++... none
  68. checking whether x86_64-pc-linux-gnu-gcc is blacklisted... no
  69. checking whether x86_64-pc-linux-gnu-g++ supports -Wmissing-format-attribute... yes
  70. checking whether x86_64-pc-linux-gnu-gcc supports -Wmissing-format-attribute... yes
  71. checking whether x86_64-pc-linux-gnu-g++ supports -Wundef... yes
  72. checking whether x86_64-pc-linux-gnu-g++ supports -Wno-long-long... yes
  73. checking whether x86_64-pc-linux-gnu-g++ supports -Wno-non-virtual-dtor... yes
  74. checking whether x86_64-pc-linux-gnu-g++ supports -fno-reorder-blocks... yes
  75. checking whether x86_64-pc-linux-gnu-g++ supports -fno-exceptions... yes
  76. checking whether x86_64-pc-linux-gnu-g++ supports -fno-check-new... yes
  77. checking whether x86_64-pc-linux-gnu-g++ supports -fno-common... yes
  78. checking whether x86_64-pc-linux-gnu-g++ supports -fexceptions... yes
  79. checking whether system headers can cope with -O2 -fno-inline... irrelevant
  80. checking how to run the C++ preprocessor... x86_64-pc-linux-gnu-g++ -E
  81. checking whether x86_64-pc-linux-gnu-g++ supports -O0... yes
  82. checking whether x86_64-pc-linux-gnu-g++ supports -Wl,--no-undefined... yes
  83. checking whether x86_64-pc-linux-gnu-g++ supports -Wl,--allow-shlib-undefined... yes
  84. using lib directory suffix 64
  85. checking for a sed that does not truncate output... /bin/sed
  86. checking for grep that handles long lines and -e... /bin/grep
  87. checking for egrep... /bin/grep -E
  88. checking for ld used by x86_64-pc-linux-gnu-gcc... /usr/x86_64-pc-linux-gnu/bin/ld
  89. checking if the linker (/usr/x86_64-pc-linux-gnu/bin/ld) is GNU ld... yes
  90. checking for /usr/x86_64-pc-linux-gnu/bin/ld option to reload object files... -r
  91. checking for BSD-compatible nm... /usr/bin/x86_64-pc-linux-gnu-nm -B
  92. checking whether ln -s works... yes
  93. checking how to recognise dependent libraries... pass_all
  94. checking for ANSI C header files... yes
  95. checking for sys/types.h... yes
  96. checking for sys/stat.h... yes
  97. checking for stdlib.h... yes
  98. checking for string.h... yes
  99. checking for memory.h... yes
  100. checking for strings.h... yes
  101. checking for inttypes.h... yes
  102. checking for stdint.h... yes
  103. checking for unistd.h... yes
  104. checking dlfcn.h usability... yes
  105. checking dlfcn.h presence... yes
  106. checking for dlfcn.h... yes
  107. checking for x86_64-pc-linux-gnu-g77... no
  108. checking for x86_64-pc-linux-gnu-xlf... no
  109. checking for x86_64-pc-linux-gnu-f77... no
  110. checking for x86_64-pc-linux-gnu-frt... no
  111. checking for x86_64-pc-linux-gnu-pgf77... no
  112. checking for x86_64-pc-linux-gnu-cf77... no
  113. checking for x86_64-pc-linux-gnu-fort77... no
  114. checking for x86_64-pc-linux-gnu-fl32... no
  115. checking for x86_64-pc-linux-gnu-af77... no
  116. checking for x86_64-pc-linux-gnu-xlf90... no
  117. checking for x86_64-pc-linux-gnu-f90... no
  118. checking for x86_64-pc-linux-gnu-pgf90... no
  119. checking for x86_64-pc-linux-gnu-pghpf... no
  120. checking for x86_64-pc-linux-gnu-epcf90... no
  121. checking for x86_64-pc-linux-gnu-gfortran... x86_64-pc-linux-gnu-gfortran
  122. checking whether we are using the GNU Fortran 77 compiler... yes
  123. checking whether x86_64-pc-linux-gnu-gfortran accepts -g... yes
  124. checking the maximum length of command line arguments... 32768
  125. checking command to parse /usr/bin/x86_64-pc-linux-gnu-nm -B output from x86_64-pc-linux-gnu-gcc object... ok
  126. checking for objdir... .libs
  127. checking for x86_64-pc-linux-gnu-ar... x86_64-pc-linux-gnu-ar
  128. checking for x86_64-pc-linux-gnu-ranlib... x86_64-pc-linux-gnu-ranlib
  129. checking for x86_64-pc-linux-gnu-strip... x86_64-pc-linux-gnu-strip
  130. checking if x86_64-pc-linux-gnu-gcc static flag  works... yes
  131. checking if x86_64-pc-linux-gnu-gcc supports -fno-rtti -fno-exceptions... no
  132. checking for x86_64-pc-linux-gnu-gcc option to produce PIC... -fPIC
  133. checking if x86_64-pc-linux-gnu-gcc PIC flag -fPIC works... yes
  134. checking if x86_64-pc-linux-gnu-gcc supports -c -o file.o... yes
  135. checking whether the x86_64-pc-linux-gnu-gcc linker (/usr/x86_64-pc-linux-gnu/bin/ld -m elf_x86_64) supports shared libraries... yes
  136. checking whether -lc should be explicitly linked in... no
  137. checking dynamic linker characteristics... GNU/Linux ld.so
  138. checking how to hardcode library paths into programs... immediate
  139. checking whether stripping libraries is possible... yes
  140. checking for shl_load... no
  141. checking for shl_load in -ldld... no
  142. checking for dlopen... no
  143. checking for dlopen in -ldl... yes
  144. checking whether a program can dlopen itself... yes
  145. checking whether a statically linked program can dlopen itself... yes
  146. checking if libtool supports shared libraries... yes
  147. checking whether to build shared libraries... yes
  148. checking whether to build static libraries... no
  149. configure: creating libtool
  150. appending configuration tag "CXX" to libtool
  151. checking for ld used by x86_64-pc-linux-gnu-g++... /usr/x86_64-pc-linux-gnu/bin/ld -m elf_x86_64
  152. checking if the linker (/usr/x86_64-pc-linux-gnu/bin/ld -m elf_x86_64) is GNU ld... yes
  153. checking whether the x86_64-pc-linux-gnu-g++ linker (/usr/x86_64-pc-linux-gnu/bin/ld -m elf_x86_64) supports shared libraries... yes
  154. checking for x86_64-pc-linux-gnu-g++ option to produce PIC... -fPIC
  155. checking if x86_64-pc-linux-gnu-g++ PIC flag -fPIC works... yes
  156. checking if x86_64-pc-linux-gnu-g++ supports -c -o file.o... yes
  157. checking whether the x86_64-pc-linux-gnu-g++ linker (/usr/x86_64-pc-linux-gnu/bin/ld -m elf_x86_64) supports shared libraries... yes
  158. checking dynamic linker characteristics... GNU/Linux ld.so
  159. checking how to hardcode library paths into programs... immediate
  160. checking whether stripping libraries is possible... yes
  161. checking for shl_load... (cached) no
  162. checking for shl_load in -ldld... (cached) no
  163. checking for dlopen... (cached) no
  164. checking for dlopen in -ldl... (cached) yes
  165. checking whether a program can dlopen itself... (cached) yes
  166. checking whether a statically linked program can dlopen itself... (cached) yes
  167. appending configuration tag "F77" to libtool
  168. checking if libtool supports shared libraries... yes
  169. checking whether to build shared libraries... yes
  170. checking whether to build static libraries... no
  171. checking for x86_64-pc-linux-gnu-gfortran option to produce PIC... -fPIC
  172. checking if x86_64-pc-linux-gnu-gfortran PIC flag -fPIC works... yes
  173. checking if x86_64-pc-linux-gnu-gfortran supports -c -o file.o... yes
  174. checking whether the x86_64-pc-linux-gnu-gfortran linker (/usr/x86_64-pc-linux-gnu/bin/ld -m elf_x86_64) supports shared libraries... yes
  175. checking dynamic linker characteristics... GNU/Linux ld.so
  176. checking how to hardcode library paths into programs... immediate
  177. checking whether stripping libraries is possible... yes
  178. checking for msgfmt... /usr/bin/msgfmt
  179. checking for gmsgfmt... /usr/bin/gmsgfmt
  180. checking for xgettext... /usr/bin/xgettext
  181. checking if C++ programs can be compiled... yes
  182. checking for strlcat... no
  183. checking if strlcat needs custom prototype... yes - in libkdefakes
  184. checking for strlcpy... no
  185. checking if strlcpy needs custom prototype... yes - in libkdefakes
  186. checking for main in -lutil... yes
  187. checking for main in -lcompat... no
  188. checking for crypt in -lcrypt... yes
  189. checking for socklen_t... yes
  190. checking for dnet_ntoa in -ldnet... no
  191. checking for dnet_ntoa in -ldnet_stub... no
  192. checking for inet_ntoa... yes
  193. checking for connect... yes
  194. checking for remove... yes
  195. checking for shmat... yes
  196. checking for sys/types.h... (cached) yes
  197. checking for stdint.h... (cached) yes
  198. checking sys/bitypes.h usability... yes
  199. checking sys/bitypes.h presence... yes
  200. checking for sys/bitypes.h... yes
  201. checking for poll in -lpoll... no
  202. checking Carbon/Carbon.h usability... no
  203. checking Carbon/Carbon.h presence... no
  204. checking for Carbon/Carbon.h... no
  205. checking CoreAudio/CoreAudio.h usability... no
  206. checking CoreAudio/CoreAudio.h presence... no
  207. checking for CoreAudio/CoreAudio.h... no
  208. checking if res_init needs -lresolv... yes
  209. checking for res_init... yes
  210. checking if res_init needs custom prototype... no
  211. checking for killpg in -lucb... no
  212. checking for int... yes
  213. checking size of int... 4
  214. checking for short... yes
  215. checking size of short... 2
  216. checking for long... yes
  217. checking size of long... 8
  218. checking for char *... yes
  219. checking size of char *... 8
  220. checking for dlopen in -ldl... (cached) yes
  221. checking for shl_unload in -ldld... no
  222. checking for size_t... yes
  223. checking size of size_t... 8
  224. checking for unsigned long... yes
  225. checking size of unsigned long... 8
  226. checking sizeof size_t == sizeof unsigned long... yes
  227. checking for PIE support... yes
  228. checking if enabling -pie/fPIE support... yes
  229. checking crt_externs.h usability... no
  230. checking crt_externs.h presence... no
  231. checking for crt_externs.h... no
  232. checking for _NSGetEnviron... no
  233. checking for vsnprintf... yes
  234. checking for snprintf... yes
  235. checking for X... libraries /usr/lib64, headers .
  236. checking for IceConnectionNumber in -lICE... yes
  237. checking for libXext... yes
  238. checking for pthread_create in -lpthread... yes
  239. checking for extra includes... added
  240. checking for extra libs... added
  241. checking for libz... -lz
  242. checking for libpng... -lpng -lz -lm
  243. checking for libjpeg6b... no
  244. checking for libjpeg... -ljpeg
  245. checking for perl... /usr/bin/perl
  246. checking for Qt... libraries /usr/qt/3/lib64, headers /usr/qt/3/include using -mt
  247. checking for moc... /usr/qt/3/bin/moc
  248. checking for uic... /usr/qt/3/bin/uic
  249. checking whether uic supports -L ... yes
  250. checking whether uic supports -nounload ... yes
  251. checking if Qt needs -ljpeg... no
  252. checking for rpath... yes
  253. checking for KDE... libraries /usr/kde/3.5/lib64, headers /usr/kde/3.5/include
  254. checking if UIC has KDE plugins available... yes
  255. checking for KDE paths... defaults
  256. checking for dcopidl... /usr/kde/3.5/bin/dcopidl
  257. checking for dcopidl2cpp... /usr/kde/3.5/bin/dcopidl2cpp
  258. checking for mcopidl... /usr/kde/3.5/bin/mcopidl
  259. checking for artsc-config... /usr/kde/3.5/bin/artsc-config
  260. checking for meinproc... /usr/kde/3.5/bin/meinproc
  261. checking for kconfig_compiler... /usr/kde/3.5/bin/kconfig_compiler
  262. checking for dcopidlng... /usr/kde/3.5/bin/dcopidlng
  263. checking for xmllint... /usr/bin/xmllint
  264. checking for Qt docs... NO
  265. checking for dot... /usr/bin/dot
  266. checking for doxygen... /usr/bin/doxygen
  267. checking if hidden visibility should be enabled... yes
  268. checking grepping for visibility push/pop in headers... yes
  269. checking whether x86_64-pc-linux-gnu-g++ supports -fvisibility=hidden... yes
  270. checking if Qt is patched for -fvisibility... yes
  271. checking for gcc -fvisibility-inlines-hidden bug... no
  272. checking for pkg-config... yes
  273. checking for int... (cached) yes
  274. checking size of int... (cached) 4
  275. checking for short... (cached) yes
  276. checking size of short... (cached) 2
  277. checking for long... (cached) yes
  278. checking size of long... (cached) 8
  279. checking for char *... (cached) yes
  280. checking size of char *... (cached) 8
  281. checking whether byte ordering is bigendian... no
  282. checking for pkg-config... /usr/bin/pkg-config
  283. checking for sqlite3 >= 3.0... yes
  284. checking SQLITE_CFLAGS... 
  285. checking SQLITE_LIBS... -lsqlite3 
  286. checking lcms/lcms.h usability... no
  287. checking lcms/lcms.h presence... no
  288. checking for lcms/lcms.h... no
  289. checking lcms.h usability... yes
  290. checking lcms.h presence... yes
  291. checking for lcms.h... yes
  292. checking for gphoto2-config... /usr/bin/gphoto2-config
  293. checking for gphoto2-port-config... /usr/bin/gphoto2-port-config
  294. checking for libkipi >= 0.1... yes
  295. checking LIBKIPI_CFLAGS... 
  296. checking LIBKIPI_LIBS... -lkipi 
  297. found
  298. checking for libkexiv2 >= 0.1.5... yes
  299. checking LIBKEXIV2_CFLAGS... 
  300. checking LIBKEXIV2_LIBS... -lkexiv2 
  301. found
  302. checking for libkdcraw >= 0.1.1... yes
  303. checking LIBKDCRAW_CFLAGS... 
  304. checking LIBKDCRAW_LIBS... -lkdcraw 
  305. found
  306. checking for TIFFWriteScanline in -ltiff... yes
  307. checking tiffio.h usability... yes
  308. checking tiffio.h presence... yes
  309. checking for tiffio.h... yes
  310. checking for png_set_add_alpha in -lpng... yes
  311. checking for jas_init in -ljasper... yes
  312. configure: creating ./config.status
  313. wrong input (flag != 4) at admin/conf.change.pl line 117, <> line 1262.
  314. config.status: creating digikam/utilities/hotplug/digikam-download.desktop
  315. config.status: creating config.h
  316. config.status: executing depfiles commands
  317. configure: creating ./config.status
  318. wrong input (flag != 4) at admin/conf.change.pl line 117, <> line 1263.
  319. config.status: creating digikam/utilities/hotplug/digikam-download.desktop
  320. config.status: creating digikam/utilities/hotplug/digikam-gphoto2-camera.desktop
  321. config.status: creating config.h
  322. config.status: config.h is unchanged
  323. config.status: executing depfiles commands
  324. configure: creating ./config.status
  325. wrong input (flag != 4) at admin/conf.change.pl line 117, <> line 1264.
  326. config.status: creating digikam/utilities/hotplug/digikam-download.desktop
  327. config.status: creating digikam/utilities/hotplug/digikam-gphoto2-camera.desktop
  328. config.status: creating digikam/utilities/hotplug/digikam-mount-and-download.desktop
  329. config.status: creating config.h
  330. config.status: config.h is unchanged
  331. config.status: executing depfiles commands
  332. checking if digikam should be compiled... yes
  333. checking if doc should be compiled... yes
  334. checking if po should be compiled... yes
  335. configure: creating ./config.status
  336. wrong input (flag != 4) at admin/conf.change.pl line 117, <> line 1407.
  337. config.status: creating digikam/utilities/hotplug/digikam-download.desktop
  338. config.status: creating digikam/utilities/hotplug/digikam-gphoto2-camera.desktop
  339. config.status: creating digikam/utilities/hotplug/digikam-mount-and-download.desktop
  340. config.status: creating Makefile
  341. config.status: creating digikam/Makefile
  342. config.status: creating digikam/data/Makefile
  343. config.status: creating digikam/data/about/Makefile
  344. config.status: creating digikam/data/icons/Makefile
  345. config.status: creating digikam/data/pics/Makefile
  346. config.status: creating digikam/data/profiles/Makefile
  347. config.status: creating digikam/data/themes/Makefile
  348. config.status: creating digikam/digikam/Makefile
  349. config.status: creating digikam/imageplugins/Makefile
  350. config.status: creating digikam/imageplugins/adjustcurves/Makefile
  351. config.status: creating digikam/imageplugins/adjustlevels/Makefile
  352. config.status: creating digikam/imageplugins/antivignetting/Makefile
  353. config.status: creating digikam/imageplugins/blurfx/Makefile
  354. config.status: creating digikam/imageplugins/border/Makefile
  355. config.status: creating digikam/imageplugins/border/patterns/Makefile
  356. config.status: creating digikam/imageplugins/channelmixer/Makefile
  357. config.status: creating digikam/imageplugins/charcoal/Makefile
  358. config.status: creating digikam/imageplugins/colorfx/Makefile
  359. config.status: creating digikam/imageplugins/coreplugin/Makefile
  360. config.status: creating digikam/imageplugins/coreplugin/hsl/Makefile
  361. config.status: creating digikam/imageplugins/coreplugin/ratiocrop/Makefile
  362. config.status: creating digikam/imageplugins/coreplugin/sharpnesseditor/Makefile
  363. config.status: creating digikam/imageplugins/coreplugin/sharpnesseditor/clapack/Makefile
  364. config.status: creating digikam/imageplugins/distortionfx/Makefile
  365. config.status: creating digikam/imageplugins/emboss/Makefile
  366. config.status: creating digikam/imageplugins/filmgrain/Makefile
  367. config.status: creating digikam/imageplugins/freerotation/Makefile
  368. config.status: creating digikam/imageplugins/hotpixels/Makefile
  369. config.status: creating digikam/imageplugins/infrared/Makefile
  370. config.status: creating digikam/imageplugins/inpainting/Makefile
  371. config.status: creating digikam/imageplugins/inserttext/Makefile
  372. config.status: creating digikam/imageplugins/lensdistortion/Makefile
  373. config.status: creating digikam/imageplugins/noisereduction/Makefile
  374. config.status: creating digikam/imageplugins/oilpaint/Makefile
  375. config.status: creating digikam/imageplugins/perspective/Makefile
  376. config.status: creating digikam/imageplugins/raindrop/Makefile
  377. config.status: creating digikam/imageplugins/restoration/Makefile
  378. config.status: creating digikam/imageplugins/sheartool/Makefile
  379. config.status: creating digikam/imageplugins/superimpose/Makefile
  380. config.status: creating digikam/imageplugins/texture/Makefile
  381. config.status: creating digikam/imageplugins/texture/patterns/Makefile
  382. config.status: creating digikam/imageplugins/whitebalance/Makefile
  383. config.status: creating digikam/kioslave/Makefile
  384. config.status: creating digikam/libs/Makefile
  385. config.status: creating digikam/libs/curves/Makefile
  386. config.status: creating digikam/libs/dialogs/Makefile
  387. config.status: creating digikam/libs/dimg/Makefile
  388. config.status: creating digikam/libs/dimg/filters/Makefile
  389. config.status: creating digikam/libs/dimg/loaders/Makefile
  390. config.status: creating digikam/libs/dmetadata/Makefile
  391. config.status: creating digikam/libs/greycstoration/Makefile
  392. config.status: creating digikam/libs/histogram/Makefile
  393. config.status: creating digikam/libs/imageproperties/Makefile
  394. config.status: creating digikam/libs/jpegutils/Makefile
  395. config.status: creating digikam/libs/levels/Makefile
  396. config.status: creating digikam/libs/lprof/Makefile
  397. config.status: creating digikam/libs/themeengine/Makefile
  398. config.status: creating digikam/libs/threadimageio/Makefile
  399. config.status: creating digikam/libs/thumbbar/Makefile
  400. config.status: creating digikam/libs/whitebalance/Makefile
  401. config.status: creating digikam/libs/widgets/Makefile
  402. config.status: creating digikam/libs/widgets/common/Makefile
  403. config.status: creating digikam/libs/widgets/iccprofiles/Makefile
  404. config.status: creating digikam/libs/widgets/imageplugins/Makefile
  405. config.status: creating digikam/libs/widgets/metadata/Makefile
  406. config.status: creating digikam/showfoto/Makefile
  407. config.status: creating digikam/showfoto/icons/Makefile
  408. config.status: creating digikam/showfoto/pics/Makefile
  409. config.status: creating digikam/showfoto/setup/Makefile
  410. config.status: creating digikam/sqlite/Makefile
  411. config.status: creating digikam/themedesigner/Makefile
  412. config.status: creating digikam/utilities/Makefile
  413. config.status: creating digikam/utilities/batch/Makefile
  414. config.status: creating digikam/utilities/cameragui/Makefile
  415. config.status: creating digikam/utilities/hotplug/Makefile
  416. config.status: creating digikam/utilities/imageeditor/Makefile
  417. config.status: creating digikam/utilities/imageeditor/canvas/Makefile
  418. config.status: creating digikam/utilities/imageeditor/editor/Makefile
  419. config.status: creating digikam/utilities/imageeditor/tools/Makefile
  420. config.status: creating digikam/utilities/lighttable/Makefile
  421. config.status: creating digikam/utilities/scripts/Makefile
  422. config.status: creating digikam/utilities/setup/Makefile
  423. config.status: creating digikam/utilities/slideshow/Makefile
  424. config.status: creating digikam/utilities/splashscreen/Makefile
  425. config.status: creating doc/Makefile
  426. config.status: creating po/Makefile
  427. config.status: creating po/ar/Makefile
  428. config.status: creating po/bg/Makefile
  429. config.status: creating po/br/Makefile
  430. config.status: creating po/ca/Makefile
  431. config.status: creating po/cs/Makefile
  432. config.status: creating po/cy/Makefile
  433. config.status: creating po/da/Makefile
  434. config.status: creating po/de/Makefile
  435. config.status: creating po/el/Makefile
  436. config.status: creating po/en_GB/Makefile
  437. config.status: creating po/es/Makefile
  438. config.status: creating po/et/Makefile
  439. config.status: creating po/fa/Makefile
  440. config.status: creating po/fi/Makefile
  441. config.status: creating po/fr/Makefile
  442. config.status: creating po/gl/Makefile
  443. config.status: creating po/he/Makefile
  444. config.status: creating po/hu/Makefile
  445. config.status: creating po/is/Makefile
  446. config.status: creating po/it/Makefile
  447. config.status: creating po/ja/Makefile
  448. config.status: creating po/ka/Makefile
  449. config.status: creating po/lt/Makefile
  450. config.status: creating po/mk/Makefile
  451. config.status: creating po/ms/Makefile
  452. config.status: creating po/mt/Makefile
  453. config.status: creating po/nb/Makefile
  454. config.status: creating po/nds/Makefile
  455. config.status: creating po/nl/Makefile
  456. config.status: creating po/nn/Makefile
  457. config.status: creating po/pa/Makefile
  458. config.status: creating po/pl/Makefile
  459. config.status: creating po/pt/Makefile
  460. config.status: creating po/pt_BR/Makefile
  461. config.status: creating po/ro/Makefile
  462. config.status: creating po/ru/Makefile
  463. config.status: creating po/rw/Makefile
  464. config.status: creating po/sk/Makefile
  465. config.status: creating po/sl/Makefile
  466. config.status: creating po/sr/Makefile
  467. config.status: creating po/[email protected]/Makefile
  468. config.status: creating po/sv/Makefile
  469. config.status: creating po/ta/Makefile
  470. config.status: creating po/th/Makefile
  471. config.status: creating po/tr/Makefile
  472. config.status: creating po/uk/Makefile
  473. config.status: creating po/vi/Makefile
  474. config.status: creating po/zh_CN/Makefile
  475. config.status: creating po/zh_TW/Makefile
  476. config.status: creating config.h
  477. config.status: config.h is unchanged
  478. config.status: executing depfiles commands
  479.  
  480. -- digiKam configure results -------------------
  481. -- libsqlite3 library found....... YES
  482. -- libgphoto2 library found....... YES
  483. -- libkipi library found.......... YES
  484. -- libtiff library found..... .... YES
  485. -- libpng library found........... YES
  486. -- libjasper library found........ YES
  487. -- liblcms library found.......... YES
  488. -- libkexiv2 library found........ YES
  489. -- libkdcraw library found........ YES
  490. ------------------------------------------------
  491.  
  492. Good - your configure finished. Start make now
  493.  
  494. Making all in digikam
  495. Making all in sqlite
  496. mkdir: cannot create directory `.libs': File exists
  497. In file included from auth.c:19In file included from attach.c:16:
  498. sqliteInt.h:118:2: warning: #warning "WARNING: Compiling sqlite for a 64 bit Platform."
  499. sqliteInt.h:119:2: warning: #warning "WARNING: If you know this is not true, please file a bugreport."
  500. :
  501. sqliteInt.h:118:2: warning: #warning "WARNING: Compiling sqlite for a 64 bit Platform."
  502. sqliteInt.h:119:2: warning: #warning "WARNING: If you know this is not true, please file a bugreport."
  503. In file included from btree.c:52:
  504. sqliteInt.h:118:2: warning: #warning "WARNING: Compiling sqlite for a 64 bit Platform."
  505. sqliteInt.h:119:2: warning: #warning "WARNING: If you know this is not true, please file a bugreport."
  506. btree.c:390: warning: no previous prototype for 'swab16'
  507. btree.c:393: warning: no previous prototype for 'swab32'
  508. attach.c: In function 'sqliteAttach':
  509. attach.c:117: warning: declaration of 'i' shadows a previous local
  510. attach.c:28: warning: shadowed declaration is here
  511. attach.c:26: warning: unused parameter 'pKey'
  512. btree.c: In function 'cellSize':
  513. btree.c:407: warning: comparison between signed and unsigned
  514. btree.c: In function 'initPage':
  515. btree.c:585: warning: declaration of 'freeSpace' shadows a global declaration
  516. btree.c:519: warning: shadowed declaration is here
  517. btree.c:601: warning: comparison between signed and unsigned
  518. btree.c:602: warning: comparison between signed and unsigned
  519. btree.c:615: warning: comparison between signed and unsigned
  520. btree.c:616: warning: comparison between signed and unsigned
  521. btree.c:580: warning: unused parameter 'pgnoThis'
  522. btree.c: In function 'lockBtree':
  523. btree.c:786: warning: dereferencing type-punned pointer will break strict-aliasing rules
  524. btree.c:795: warning: comparison between signed and unsigned
  525. btree.c:799: warning: comparison between signed and unsigned
  526. btree.c: In function 'newDatabase':
  527. btree.c:840: warning: dereferencing type-punned pointer will break strict-aliasing rules
  528. btree.c: In function 'fileBtreeCursor':
  529. btree.c:1056: warning: dereferencing type-punned pointer will break strict-aliasing rules
  530. btree.c: In function 'getPayload':
  531. btree.c:1184: warning: comparison between signed and unsigned
  532. btree.c:1186: warning: comparison between signed and unsigned
  533. btree.c:1204: warning: dereferencing type-punned pointer will break strict-aliasing rules
  534. btree.c:1209: warning: comparison between signed and unsigned
  535. btree.c:1211: warning: comparison between signed and unsigned
  536. btree.c: In function 'fileBtreeKeyCompare':
  537. btree.c:1344: warning: comparison between signed and unsigned
  538. btree.c:1361: warning: dereferencing type-punned pointer will break strict-aliasing rules
  539. btree.c:1367: warning: comparison between signed and unsigned
  540. btree.c: In function 'moveToChild':
  541. btree.c:1396: warning: signed and unsigned type in conditional expression
  542. btree.c:1397: warning: dereferencing type-punned pointer will break strict-aliasing rules
  543. btree.c: In function 'moveToRoot':
  544. btree.c:1477: warning: dereferencing type-punned pointer will break strict-aliasing rules
  545. btree.c: In function 'allocatePage':
  546. btree.c:1763: warning: dereferencing type-punned pointer will break strict-aliasing rules
  547. btree.c:1777: warning: signed and unsigned type in conditional expression
  548. btree.c: In function 'freePage':
  549. btree.c:1843: warning: dereferencing type-punned pointer will break strict-aliasing rules
  550. btree.c:1846: warning: signed and unsigned type in conditional expression
  551. btree.c:1847: warning: comparison between signed and unsigned
  552. btree.c:1862: warning: dereferencing type-punned pointer will break strict-aliasing rules
  553. btree.c: In function 'clearCell':
  554. btree.c:1888: warning: comparison between signed and unsigned
  555. btree.c:1894: warning: dereferencing type-punned pointer will break strict-aliasing rules
  556. btree.c: In function 'fillInCell':
  557. btree.c:1940: warning: dereferencing type-punned pointer will break strict-aliasing rules
  558. btree.c: In function 'balance':
  559. btree.c:2235: warning: dereferencing type-punned pointer will break strict-aliasing rules
  560. btree.c:2423: warning: comparison between signed and unsigned
  561. btree.c:2434: warning: comparison between signed and unsigned
  562. btree.c: In function 'clearDatabasePage':
  563. btree.c:2806: warning: dereferencing type-punned pointer will break strict-aliasing rules
  564. btree.c: In function 'fileBtreeDropTable':
  565. btree.c:2875: warning: dereferencing type-punned pointer will break strict-aliasing rules
  566. btree.c: In function 'fileBtreeGetMeta':
  567. btree.c:2995: warning: dereferencing type-punned pointer will break strict-aliasing rules
  568. btree.c:2997: warning: signed and unsigned type in conditional expression
  569. btree.c:2998: warning: comparison between signed and unsigned
  570. btree.c:2999: warning: signed and unsigned type in conditional expression
  571. btree.c: In function 'fileBtreeUpdateMeta':
  572. btree.c:3017: warning: comparison between signed and unsigned
  573. btree.c:3018: warning: signed and unsigned type in conditional expression
  574. btree.c: In function 'checkList':
  575. btree.c:3229: warning: dereferencing type-punned pointer will break strict-aliasing rules
  576. btree.c:3236: warning: signed and unsigned type in conditional expression
  577. btree.c: In function 'checkTreePage':
  578. btree.c:3308: warning: dereferencing type-punned pointer will break strict-aliasing rules
  579. btree.c:3341: warning: comparison between signed and unsigned
  580. btree.c:3352: warning: passing argument 3 of 'checkAppendMsg' discards qualifiers from pointer target type
  581. btree.c:3360: warning: passing argument 3 of 'checkAppendMsg' discards qualifiers from pointer target type
  582. btree.c: At top level:
  583. btree.c:3424: warning: no previous prototype for 'fileBtreeIntegrityCheck'
  584. btree.c: In function 'fileBtreeIntegrityCheck':
  585. btree.c:3448: warning: signed and unsigned type in conditional expression
  586. btree.c:3448: warning: passing argument 5 of 'checkList' discards qualifiers from pointer target type
  587. btree.c:3454: warning: passing argument 4 of 'checkTreePage' discards qualifiers from pointer target type
  588. btree.c: In function 'balance':
  589. btree.c:2190: warning: 'pOldCurPage' may be used uninitialized in this function
  590. btree.c:2189: warning: 'iCur' may be used uninitialized in this function
  591. In file included from build.c:28:
  592. sqliteInt.h:118:2: warning: #warning "WARNING: Compiling sqlite for a 64 bit Platform."
  593. sqliteInt.h:119:2: warning: #warning "WARNING: If you know this is not true, please file a bugreport."
  594. In file included from copy.c:16:
  595. sqliteInt.h:118:2: warning: #warning "WARNING: Compiling sqlite for a 64 bit Platform."
  596. sqliteInt.h:119:2: warning: #warning "WARNING: If you know this is not true, please file a bugreport."
  597. In file included from btree_rb.c:20:
  598. sqliteInt.h:118:2: warning: #warning "WARNING: Compiling sqlite for a 64 bit Platform."
  599. sqliteInt.h:119:2: warning: #warning "WARNING: If you know this is not true, please file a bugreport."
  600. btree_rb.c: In function 'print_node':
  601. btree_rb.c:314: warning: format not a string literal and no format arguments
  602. btree_rb.c: In function 'sqliteRbtreeOpen':
  603. btree_rb.c:613: warning: unused parameter 'zFilename'
  604. btree_rb.c:614: warning: unused parameter 'mode'
  605. btree_rb.c:615: warning: unused parameter 'nPg'
  606. btree_rb.c: In function 'memRbtreeIntegrityCheck':
  607. btree_rb.c:1242: warning: unused parameter 'aRoot'
  608. btree_rb.c:1242: warning: unused parameter 'nRoot'
  609. btree_rb.c: In function 'memRbtreeSetCacheSize':
  610. btree_rb.c:1255: warning: unused parameter 'tree'
  611. btree_rb.c:1255: warning: unused parameter 'sz'
  612. btree_rb.c: In function 'memRbtreeSetSafetyLevel':
  613. btree_rb.c:1260: warning: unused parameter 'pBt'
  614. btree_rb.c:1260: warning: unused parameter 'level'
  615. btree_rb.c: In function 'memRbtreePager':
  616. btree_rb.c:1423: warning: unused parameter 'tree'
  617. btree_rb.c: In function 'memRbtreeGetFilename':
  618. btree_rb.c:1431: warning: unused parameter 'pBt'
  619. btree_rb.c: In function 'memRbtreeCopyFile':
  620. btree_rb.c:1438: warning: unused parameter 'pBt'
  621. btree_rb.c:1438: warning: unused parameter 'pBt2'
  622. build.c: In function 'sqliteStartTable':
  623. build.c:445: warning: initialization discards qualifiers from pointer target type
  624. build.c: In function 'createTableStmt':
  625. build.c:838: warning: assignment discards qualifiers from pointer target type
  626. build.c:839: warning: assignment discards qualifiers from pointer target type
  627. build.c:840: warning: assignment discards qualifiers from pointer target type
  628. build.c:842: warning: assignment discards qualifiers from pointer target type
  629. build.c:843: warning: assignment discards qualifiers from pointer target type
  630. build.c:844: warning: assignment discards qualifiers from pointer target type
  631. build.c: In function 'sqliteCreateView':
  632. build.c:1037: warning: cast from pointer to integer of different size
  633. build.c:1037: warning: cast from pointer to integer of different size
  634. build.c: At top level:
  635. build.c:1158: warning: no previous prototype for 'sqliteTableFromToken'
  636. build.c: In function 'sqliteCreateIndex':
  637. build.c:1684: warning: declaration of 'i' shadows a previous local
  638. build.c:1484: warning: shadowed declaration is here
  639. In file included from delete.c:17:
  640. sqliteInt.h:118:2: warning: #warning "WARNING: Compiling sqlite for a 64 bit Platform."
  641. sqliteInt.h:119:2: warning: #warning "WARNING: If you know this is not true, please file a bugreport."
  642. delete.c: In function 'sqliteDeleteFrom':
  643. delete.c:172: warning: declaration of 'addr' shadows a previous local
  644. delete.c:64: warning: shadowed declaration is here
  645. delete.c:64: warning: 'addr' may be used uninitialized in this function
  646. In file included from expr.c:17:
  647. sqliteInt.h:118:2: warning: #warning "WARNING: Compiling sqlite for a 64 bit Platform."
  648. sqliteInt.h:119:2: warning: #warning "WARNING: If you know this is not true, please file a bugreport."
  649. expr.c: In function 'lookupName':
  650. expr.c:498: warning: declaration of 'j' shadows a previous local
  651. expr.c:418: warning: shadowed declaration is here
  652. expr.c:569: warning: assignment discards qualifiers from pointer target type
  653. expr.c: In function 'sqliteExprResolveIds':
  654. expr.c:704: warning: declaration of 'i' shadows a previous local
  655. expr.c:632: warning: shadowed declaration is here
  656. expr.c:764: warning: declaration of 'i' shadows a previous local
  657. expr.c:632: warning: shadowed declaration is here
  658. expr.c: In function 'sqliteExprAnalyzeAggregates':
  659. expr.c:1601: warning: declaration of 'i' shadows a previous local
  660. expr.c:1548: warning: shadowed declaration is here
  661. encode.c:123: warning: no previous prototype for 'sqlite_encode_binary'
  662. encode.c:175: warning: no previous prototype for 'sqlite_decode_binary'
  663. encode.c: In function 'sqlite_encode_binary':
  664. encode.c:124: warning: 'e' may be used uninitialized in this function
  665. In file included from date.c:51:
  666. sqliteInt.h:118:2: warning: #warning "WARNING: Compiling sqlite for a 64 bit Platform."
  667. sqliteInt.h:119:2: warning: #warning "WARNING: If you know this is not true, please file a bugreport."
  668. date.c: In function 'parseModifier':
  669. date.c:462: warning: comparison between signed and unsigned
  670. date.c: In function 'strftimeFunc':
  671. date.c:778: warning: comparison between signed and unsigned
  672. date.c:803: warning: declaration of 'n' shadows a previous local
  673. date.c:740: warning: shadowed declaration is here
  674. date.c: In function 'sqliteRegisterDateTimeFunctions':
  675. date.c:857: warning: initialization discards qualifiers from pointer target type
  676. date.c:858: warning: initialization discards qualifiers from pointer target type
  677. date.c:859: warning: initialization discards qualifiers from pointer target type
  678. date.c:860: warning: initialization discards qualifiers from pointer target type
  679. date.c:861: warning: initialization discards qualifiers from pointer target type
  680. date.c:866: warning: comparison between signed and unsigned
  681. expr.c: In function 'sqliteExprCode':
  682. expr.c:1010: warning: 'op' may be used uninitialized in this function
  683. In file included from hash.c:17:
  684. sqliteInt.h:118:2: warning: #warning "WARNING: Compiling sqlite for a 64 bit Platform."
  685. sqliteInt.h:119:2: warning: #warning "WARNING: If you know this is not true, please file a bugreport."
  686. hash.c: In function 'intHash':
  687. hash.c:71: warning: unused parameter 'pKey'
  688. hash.c: In function 'intCompare':
  689. hash.c:74: warning: unused parameter 'pKey1'
  690. hash.c:74: warning: unused parameter 'pKey2'
  691. In file included from insert.c:17:
  692. sqliteInt.h:118:2: warning: #warning "WARNING: Compiling sqlite for a 64 bit Platform."
  693. sqliteInt.h:119:2: warning: #warning "WARNING: If you know this is not true, please file a bugreport."
  694. insert.c: In function 'sqliteGenerateConstraintChecks':
  695. insert.c:807: warning: comparison between signed and unsigned
  696. insert.c:814: warning: comparison between signed and unsigned
  697. insert.c:639: warning: 'jumpInst1' may be used uninitialized in this function
  698. In file included from func.c:25:
  699. sqliteInt.h:118:2: warning: #warning "WARNING: Compiling sqlite for a 64 bit Platform."
  700. sqliteInt.h:119:2: warning: #warning "WARNING: If you know this is not true, please file a bugreport."
  701. func.c: In function 'minmaxFunc':
  702. func.c:38: warning: cast from pointer to integer of different size
  703. func.c: In function 'typeofFunc':
  704. func.c:58: warning: unused parameter 'argc'
  705. func.c: In function 'lengthFunc':
  706. func.c:66: warning: unused parameter 'argc'
  707. func.c: In function 'absFunc':
  708. func.c:84: warning: unused parameter 'argc'
  709. func.c: In function 'substrFunc':
  710. func.c:96: warning: unused parameter 'argc'
  711. func.c: In function 'randomFunc':
  712. func.c:198: warning: unused parameter 'argc'
  713. func.c:198: warning: unused parameter 'argv'
  714. func.c: In function 'last_insert_rowid':
  715. func.c:208: warning: unused parameter 'arg'
  716. func.c:208: warning: unused parameter 'argv'
  717. func.c: In function 'change_count':
  718. func.c:217: warning: unused parameter 'arg'
  719. func.c:217: warning: unused parameter 'argv'
  720. func.c: In function 'last_statement_change_count':
  721. func.c:226: warning: unused parameter 'arg'
  722. func.c:227: warning: unused parameter 'argv'
  723. func.c: In function 'likeFunc':
  724. func.c:241: warning: unused parameter 'arg'
  725. func.c: In function 'globFunc':
  726. func.c:257: warning: unused parameter 'arg'
  727. func.c: In function 'nullifFunc':
  728. func.c:269: warning: unused parameter 'argc'
  729. func.c: In function 'versionFunc':
  730. func.c:279: warning: unused parameter 'argc'
  731. func.c:279: warning: unused parameter 'argv'
  732. func.c: In function 'minmaxStep':
  733. func.c:525: warning: cast from pointer to integer of different size
  734. func.c:534: warning: comparison between signed and unsigned
  735. func.c: In function 'sqliteRegisterBuiltinFunctions':
  736. func.c:569: warning: initialization discards qualifiers from pointer target type
  737. func.c:570: warning: initialization discards qualifiers from pointer target type
  738. func.c:571: warning: initialization discards qualifiers from pointer target type
  739. func.c:572: warning: initialization discards qualifiers from pointer target type
  740. func.c:573: warning: initialization discards qualifiers from pointer target type
  741. func.c:574: warning: initialization discards qualifiers from pointer target type
  742. func.c:575: warning: initialization discards qualifiers from pointer target type
  743. func.c:576: warning: initialization discards qualifiers from pointer target type
  744. func.c:577: warning: initialization discards qualifiers from pointer target type
  745. func.c:578: warning: initialization discards qualifiers from pointer target type
  746. func.c:579: warning: initialization discards qualifiers from pointer target type
  747. func.c:580: warning: initialization discards qualifiers from pointer target type
  748. func.c:581: warning: initialization discards qualifiers from pointer target type
  749. func.c:582: warning: initialization discards qualifiers from pointer target type
  750. func.c:583: warning: initialization discards qualifiers from pointer target type
  751. func.c:584: warning: initialization discards qualifiers from pointer target type
  752. func.c:585: warning: initialization discards qualifiers from pointer target type
  753. func.c:586: warning: initialization discards qualifiers from pointer target type
  754. func.c:587: warning: initialization discards qualifiers from pointer target type
  755. func.c:588: warning: initialization discards qualifiers from pointer target type
  756. func.c:589: warning: initialization discards qualifiers from pointer target type
  757. func.c:590: warning: initialization discards qualifiers from pointer target type
  758. func.c:591: warning: initialization discards qualifiers from pointer target type
  759. func.c:592: warning: initialization discards qualifiers from pointer target type
  760. func.c:593: warning: initialization discards qualifiers from pointer target type
  761. func.c:610: warning: initialization discards qualifiers from pointer target type
  762. func.c:611: warning: initialization discards qualifiers from pointer target type
  763. func.c:612: warning: initialization discards qualifiers from pointer target type
  764. func.c:613: warning: initialization discards qualifiers from pointer target type
  765. func.c:614: warning: initialization discards qualifiers from pointer target type
  766. func.c:615: warning: initialization discards qualifiers from pointer target type
  767. func.c:623: warning: comparison between signed and unsigned
  768. func.c:631: warning: comparison between signed and unsigned
  769. func.c:637: warning: comparison between signed and unsigned
  770. insert.c: In function 'sqliteInsert':
  771. insert.c:110: warning: 'iInsertBlock' may be used uninitialized in this function
  772. insert.c:109: warning: 'iCleanup' may be used uninitialized in this function
  773. insert.c:108: warning: 'iSelectLoop' may be used uninitialized in this function
  774. insert.c:107: warning: 'srcTab' may be used uninitialized in this function
  775. insert.c:111: warning: 'iCntMem' may be used uninitialized in this function
  776. insert.c:101: warning: 'base' may be used uninitialized in this function
  777. insert.c:102: warning: 'iBreak' may be used uninitialized in this function
  778. insert.c:102: warning: 'iCont' may be used uninitialized in this function
  779. In file included from main.c:19:
  780. sqliteInt.h:118:2: warning: #warning "WARNING: Compiling sqlite for a 64 bit Platform."
  781. sqliteInt.h:119:2: warning: #warning "WARNING: If you know this is not true, please file a bugreport."
  782. main.c: In function 'sqliteInitCallback':
  783. main.c:56: warning: unused parameter 'argc'
  784. main.c:56: warning: unused parameter 'azColName'
  785. main.c: In function 'upgrade_3_callback':
  786. main.c:139: warning: unused parameter 'argc'
  787. main.c:139: warning: unused parameter 'NotUsed'
  788. main.c: In function 'sqliteInitOne':
  789. main.c:252: warning: assignment discards qualifiers from pointer target type
  790. main.c:253: warning: assignment discards qualifiers from pointer target type
  791. main.c:254: warning: assignment discards qualifiers from pointer target type
  792. main.c:267: warning: assignment discards qualifiers from pointer target type
  793. main.c:269: warning: assignment discards qualifiers from pointer target type
  794. main.c: In function 'sqlite_open':
  795. main.c:509: warning: assignment discards qualifiers from pointer target type
  796. main.c:510: warning: assignment discards qualifiers from pointer target type
  797. main.c:471: warning: unused parameter 'mode'
  798. main.c: In function 'sqliteDefaultBusyCallback':
  799. main.c:889: warning: cast from pointer to integer of different size
  800. main.c:863: warning: unused parameter 'NotUsed'
  801. main.c: In function 'sqlite_busy_timeout':
  802. main.c:942: warning: cast to pointer from integer of different size
  803. opcodes.c:2: warning: initialization discards qualifiers from pointer target type
  804. opcodes.c:3: warning: initialization discards qualifiers from pointer target type
  805. opcodes.c:4: warning: initialization discards qualifiers from pointer target type
  806. opcodes.c:5: warning: initialization discards qualifiers from pointer target type
  807. opcodes.c:6: warning: initialization discards qualifiers from pointer target type
  808. opcodes.c:7: warning: initialization discards qualifiers from pointer target type
  809. opcodes.c:8: warning: initialization discards qualifiers from pointer target type
  810. opcodes.c:9: warning: initialization discards qualifiers from pointer target type
  811. opcodes.c:10: warning: initialization discards qualifiers from pointer target type
  812. opcodes.c:11: warning: initialization discards qualifiers from pointer target type
  813. opcodes.c:12: warning: initialization discards qualifiers from pointer target type
  814. opcodes.c:13: warning: initialization discards qualifiers from pointer target type
  815. opcodes.c:14: warning: initialization discards qualifiers from pointer target type
  816. opcodes.c:15: warning: initialization discards qualifiers from pointer target type
  817. opcodes.c:16: warning: initialization discards qualifiers from pointer target type
  818. opcodes.c:17: warning: initialization discards qualifiers from pointer target type
  819. opcodes.c:18: warning: initialization discards qualifiers from pointer target type
  820. opcodes.c:19: warning: initialization discards qualifiers from pointer target type
  821. opcodes.c:20: warning: initialization discards qualifiers from pointer target type
  822. opcodes.c:21: warning: initialization discards qualifiers from pointer target type
  823. opcodes.c:22: warning: initialization discards qualifiers from pointer target type
  824. opcodes.c:23: warning: initialization discards qualifiers from pointer target type
  825. opcodes.c:24: warning: initialization discards qualifiers from pointer target type
  826. opcodes.c:25: warning: initialization discards qualifiers from pointer target type
  827. opcodes.c:26: warning: initialization discards qualifiers from pointer target type
  828. opcodes.c:27: warning: initialization discards qualifiers from pointer target type
  829. opcodes.c:28: warning: initialization discards qualifiers from pointer target type
  830. opcodes.c:29: warning: initialization discards qualifiers from pointer target type
  831. opcodes.c:30: warning: initialization discards qualifiers from pointer target type
  832. opcodes.c:31: warning: initialization discards qualifiers from pointer target type
  833. opcodes.c:32: warning: initialization discards qualifiers from pointer target type
  834. opcodes.c:33: warning: initialization discards qualifiers from pointer target type
  835. opcodes.c:34: warning: initialization discards qualifiers from pointer target type
  836. opcodes.c:35: warning: initialization discards qualifiers from pointer target type
  837. opcodes.c:36: warning: initialization discards qualifiers from pointer target type
  838. opcodes.c:37: warning: initialization discards qualifiers from pointer target type
  839. opcodes.c:38: warning: initialization discards qualifiers from pointer target type
  840. opcodes.c:39: warning: initialization discards qualifiers from pointer target type
  841. opcodes.c:40: warning: initialization discards qualifiers from pointer target type
  842. opcodes.c:41: warning: initialization discards qualifiers from pointer target type
  843. opcodes.c:42: warning: initialization discards qualifiers from pointer target type
  844. opcodes.c:43: warning: initialization discards qualifiers from pointer target type
  845. opcodes.c:44: warning: initialization discards qualifiers from pointer target type
  846. opcodes.c:45: warning: initialization discards qualifiers from pointer target type
  847. opcodes.c:46: warning: initialization discards qualifiers from pointer target type
  848. opcodes.c:47: warning: initialization discards qualifiers from pointer target type
  849. opcodes.c:48: warning: initialization discards qualifiers from pointer target type
  850. opcodes.c:49: warning: initialization discards qualifiers from pointer target type
  851. opcodes.c:50: warning: initialization discards qualifiers from pointer target type
  852. opcodes.c:51: warning: initialization discards qualifiers from pointer target type
  853. opcodes.c:52: warning: initialization discards qualifiers from pointer target type
  854. opcodes.c:53: warning: initialization discards qualifiers from pointer target type
  855. opcodes.c:54: warning: initialization discards qualifiers from pointer target type
  856. opcodes.c:55: warning: initialization discards qualifiers from pointer target type
  857. opcodes.c:56: warning: initialization discards qualifiers from pointer target type
  858. opcodes.c:57: warning: initialization discards qualifiers from pointer target type
  859. opcodes.c:58: warning: initialization discards qualifiers from pointer target type
  860. opcodes.c:59: warning: initialization discards qualifiers from pointer target type
  861. opcodes.c:60: warning: initialization discards qualifiers from pointer target type
  862. opcodes.c:61: warning: initialization discards qualifiers from pointer target type
  863. opcodes.c:62: warning: initialization discards qualifiers from pointer target type
  864. opcodes.c:63: warning: initialization discards qualifiers from pointer target type
  865. opcodes.c:64: warning: initialization discards qualifiers from pointer target type
  866. opcodes.c:65: warning: initialization discards qualifiers from pointer target type
  867. opcodes.c:66: warning: initialization discards qualifiers from pointer target type
  868. opcodes.c:67: warning: initialization discards qualifiers from pointer target type
  869. opcodes.c:68: warning: initialization discards qualifiers from pointer target type
  870. opcodes.c:69: warning: initialization discards qualifiers from pointer target type
  871. opcodes.c:70: warning: initialization discards qualifiers from pointer target type
  872. opcodes.c:71: warning: initialization discards qualifiers from pointer target type
  873. opcodes.c:72: warning: initialization discards qualifiers from pointer target type
  874. opcodes.c:73: warning: initialization discards qualifiers from pointer target type
  875. opcodes.c:74: warning: initialization discards qualifiers from pointer target type
  876. opcodes.c:75: warning: initialization discards qualifiers from pointer target type
  877. opcodes.c:76: warning: initialization discards qualifiers from pointer target type
  878. opcodes.c:77: warning: initialization discards qualifiers from pointer target type
  879. opcodes.c:78: warning: initialization discards qualifiers from pointer target type
  880. opcodes.c:79: warning: initialization discards qualifiers from pointer target type
  881. opcodes.c:80: warning: initialization discards qualifiers from pointer target type
  882. opcodes.c:81: warning: initialization discards qualifiers from pointer target type
  883. opcodes.c:82: warning: initialization discards qualifiers from pointer target type
  884. opcodes.c:83: warning: initialization discards qualifiers from pointer target type
  885. opcodes.c:84: warning: initialization discards qualifiers from pointer target type
  886. opcodes.c:85: warning: initialization discards qualifiers from pointer target type
  887. opcodes.c:86: warning: initialization discards qualifiers from pointer target type
  888. opcodes.c:87: warning: initialization discards qualifiers from pointer target type
  889. opcodes.c:88: warning: initialization discards qualifiers from pointer target type
  890. opcodes.c:89: warning: initialization discards qualifiers from pointer target type
  891. opcodes.c:90: warning: initialization discards qualifiers from pointer target type
  892. opcodes.c:91: warning: initialization discards qualifiers from pointer target type
  893. opcodes.c:92: warning: initialization discards qualifiers from pointer target type
  894. opcodes.c:93: warning: initialization discards qualifiers from pointer target type
  895. opcodes.c:94: warning: initialization discards qualifiers from pointer target type
  896. opcodes.c:95: warning: initialization discards qualifiers from pointer target type
  897. opcodes.c:96: warning: initialization discards qualifiers from pointer target type
  898. opcodes.c:97: warning: initialization discards qualifiers from pointer target type
  899. opcodes.c:98: warning: initialization discards qualifiers from pointer target type
  900. opcodes.c:99: warning: initialization discards qualifiers from pointer target type
  901. opcodes.c:100: warning: initialization discards qualifiers from pointer target type
  902. opcodes.c:101: warning: initialization discards qualifiers from pointer target type
  903. opcodes.c:102: warning: initialization discards qualifiers from pointer target type
  904. opcodes.c:103: warning: initialization discards qualifiers from pointer target type
  905. opcodes.c:104: warning: initialization discards qualifiers from pointer target type
  906. opcodes.c:105: warning: initialization discards qualifiers from pointer target type
  907. opcodes.c:106: warning: initialization discards qualifiers from pointer target type
  908. opcodes.c:107: warning: initialization discards qualifiers from pointer target type
  909. opcodes.c:108: warning: initialization discards qualifiers from pointer target type
  910. opcodes.c:109: warning: initialization discards qualifiers from pointer target type
  911. opcodes.c:110: warning: initialization discards qualifiers from pointer target type
  912. opcodes.c:111: warning: initialization discards qualifiers from pointer target type
  913. opcodes.c:112: warning: initialization discards qualifiers from pointer target type
  914. opcodes.c:113: warning: initialization discards qualifiers from pointer target type
  915. opcodes.c:114: warning: initialization discards qualifiers from pointer target type
  916. opcodes.c:115: warning: initialization discards qualifiers from pointer target type
  917. opcodes.c:116: warning: initialization discards qualifiers from pointer target type
  918. opcodes.c:117: warning: initialization discards qualifiers from pointer target type
  919. opcodes.c:118: warning: initialization discards qualifiers from pointer target type
  920. opcodes.c:119: warning: initialization discards qualifiers from pointer target type
  921. opcodes.c:120: warning: initialization discards qualifiers from pointer target type
  922. opcodes.c:121: warning: initialization discards qualifiers from pointer target type
  923. opcodes.c:122: warning: initialization discards qualifiers from pointer target type
  924. opcodes.c:123: warning: initialization discards qualifiers from pointer target type
  925. opcodes.c:124: warning: initialization discards qualifiers from pointer target type
  926. opcodes.c:125: warning: initialization discards qualifiers from pointer target type
  927. opcodes.c:126: warning: initialization discards qualifiers from pointer target type
  928. opcodes.c:127: warning: initialization discards qualifiers from pointer target type
  929. opcodes.c:128: warning: initialization discards qualifiers from pointer target type
  930. opcodes.c:129: warning: initialization discards qualifiers from pointer target type
  931. opcodes.c:130: warning: initialization discards qualifiers from pointer target type
  932. opcodes.c:131: warning: initialization discards qualifiers from pointer target type
  933. opcodes.c:132: warning: initialization discards qualifiers from pointer target type
  934. opcodes.c:133: warning: initialization discards qualifiers from pointer target type
  935. opcodes.c:134: warning: initialization discards qualifiers from pointer target type
  936. opcodes.c:135: warning: initialization discards qualifiers from pointer target type
  937. opcodes.c:136: warning: initialization discards qualifiers from pointer target type
  938. opcodes.c:137: warning: initialization discards qualifiers from pointer target type
  939. opcodes.c:138: warning: initialization discards qualifiers from pointer target type
  940. opcodes.c:139: warning: initialization discards qualifiers from pointer target type
  941. In file included from os.c:18:
  942. sqliteInt.h:118:2: warning: #warning "WARNING: Compiling sqlite for a 64 bit Platform."
  943. sqliteInt.h:119:2: warning: #warning "WARNING: If you know this is not true, please file a bugreport."
  944. main.c: In function 'upgrade_3_callback':
  945. main.c:143: warning: 'pTrig' may be used uninitialized in this function
  946. os.c:296: warning: no previous prototype for 'findLockInfo'
  947. os.c: In function 'sqliteOsTempFileName':
  948. os.c:804: warning: comparison between signed and unsigned
  949. In file included from pager.c:24:
  950. sqliteInt.h:118:2: warning: #warning "WARNING: Compiling sqlite for a 64 bit Platform."
  951. sqliteInt.h:119:2: warning: #warning "WARNING: If you know this is not true, please file a bugreport."
  952. pager.c: In function 'pager_cksum':
  953. pager.c:516: warning: unused parameter 'aData'
  954. pager.c: In function 'pager_playback':
  955. pager.c:657: warning: comparison between signed and unsigned
  956. pager.c:680: warning: comparison between signed and unsigned
  957. pager.c:693: warning: comparison between signed and unsigned
  958. pager.c: In function 'sqlitepager_get':
  959. pager.c:1337: warning: declaration of 'rc' shadows a previous local
  960. pager.c:1313: warning: shadowed declaration is here
  961. pager.c:1415: warning: declaration of 'rc' shadows a previous local
  962. pager.c:1313: warning: shadowed declaration is here
  963. pager.c:1521: warning: declaration of 'rc' shadows a previous local
  964. pager.c:1313: warning: shadowed declaration is here
  965. In file included from pragma.c:16:
  966. sqliteInt.h:118:2: warning: #warning "WARNING: Compiling sqlite for a 64 bit Platform."
  967. sqliteInt.h:119:2: warning: #warning "WARNING: If you know this is not true, please file a bugreport."
  968. pragma.c: In function 'getBoolean':
  969. pragma.c:23: warning: initialization discards qualifiers from pointer target type
  970. pragma.c:23: warning: initialization discards qualifiers from pointer target type
  971. pragma.c:23: warning: initialization discards qualifiers from pointer target type
  972. pragma.c:29: warning: comparison between signed and unsigned
  973. pragma.c: In function 'getSafetyLevel':
  974. pragma.c:63: warning: comparison between signed and unsigned
  975. pragma.c: In function 'flagPragma':
  976. pragma.c:127: warning: comparison between signed and unsigned
  977. pragma.c: In function 'sqlitePragma':
  978. pragma.c:205: warning: initialization discards qualifiers from pointer target type
  979. pragma.c:244: warning: initialization discards qualifiers from pointer target type
  980. pragma.c:282: warning: initialization discards qualifiers from pointer target type
  981. pragma.c:335: warning: initialization discards qualifiers from pointer target type
  982. pragma.c:371: warning: initialization discards qualifiers from pointer target type
  983. pragma.c:372: warning: initialization discards qualifiers from pointer target type
  984. pragma.c:373: warning: initialization discards qualifiers from pointer target type
  985. pragma.c:374: warning: initialization discards qualifiers from pointer target type
  986. pragma.c:375: warning: initialization discards qualifiers from pointer target type
  987. pragma.c:376: warning: initialization discards qualifiers from pointer target type
  988. pragma.c:401: warning: initialization discards qualifiers from pointer target type
  989. pragma.c:402: warning: initialization discards qualifiers from pointer target type
  990. pragma.c:403: warning: initialization discards qualifiers from pointer target type
  991. pragma.c:430: warning: initialization discards qualifiers from pointer target type
  992. pragma.c:431: warning: initialization discards qualifiers from pointer target type
  993. pragma.c:432: warning: initialization discards qualifiers from pointer target type
  994. pragma.c:458: warning: initialization discards qualifiers from pointer target type
  995. pragma.c:459: warning: initialization discards qualifiers from pointer target type
  996. pragma.c:460: warning: initialization discards qualifiers from pointer target type
  997. pragma.c:461: warning: initialization discards qualifiers from pointer target type
  998. pragma.c:462: warning: initialization discards qualifiers from pointer target type
  999. pragma.c:486: warning: initialization discards qualifiers from pointer target type
  1000. pragma.c:487: warning: initialization discards qualifiers from pointer target type
  1001. pragma.c:488: warning: initialization discards qualifiers from pointer target type
  1002. pragma.c:517: warning: initialization discards qualifiers from pointer target type
  1003. pragma.c:541: warning: initialization discards qualifiers from pointer target type
  1004. pragma.c:574: warning: initialization discards qualifiers from pointer target type
  1005. pragma.c:580: warning: initialization discards qualifiers from pointer target type
  1006. pragma.c:589: warning: initialization discards qualifiers from pointer target type
  1007. pragma.c:592: warning: initialization discards qualifiers from pointer target type
  1008. pragma.c:594: warning: initialization discards qualifiers from pointer target type
  1009. pragma.c:608: warning: initialization discards qualifiers from pointer target type
  1010. pragma.c:653: warning: initialization discards qualifiers from pointer target type
  1011. pragma.c:655: warning: initialization discards qualifiers from pointer target type
  1012. pragma.c:689: warning: initialization discards qualifiers from pointer target type
  1013. In file included from parse.y:34:
  1014. sqliteInt.h:118:2: warning: #warning "WARNING: Compiling sqlite for a 64 bit Platform."
  1015. sqliteInt.h:119:2: warning: #warning "WARNING: If you know this is not true, please file a bugreport."
  1016. parse.c:1182: warning: no previous prototype for 'sqliteParserTokenName'
  1017. parse.c: In function 'sqliteParserTokenName':
  1018. parse.c:1182: warning: unused parameter 'tokenType'
  1019. parse.c: At top level:
  1020. parse.c:1206: warning: no previous prototype for 'sqliteParserAlloc'
  1021. parse.c:1421: warning: no previous prototype for 'sqliteParserFree'
  1022. parse.c: In function 'yy_find_shift_action':
  1023. parse.c:1452: warning: comparison between signed and unsigned
  1024. parse.c:1456: warning: comparison between signed and unsigned
  1025. parse.c: In function 'yy_find_reduce_action':
  1026. parse.c:1495: warning: comparison between signed and unsigned
  1027. parse.c: In function 'yy_syntax_error':
  1028. parse.c:3849: warning: unused parameter 'yymajor'
  1029. parse.c: At top level:
  1030. parse.c:3910: warning: no previous prototype for 'sqliteParser'
  1031. In file included from random.c:20:
  1032. sqliteInt.h:118:2: warning: #warning "WARNING: Compiling sqlite for a 64 bit Platform."
  1033. sqliteInt.h:119:2: warning: #warning "WARNING: If you know this is not true, please file a bugreport."
  1034. In file included from printf.c:53:
  1035. sqliteInt.h:118:2: warning: #warning "WARNING: Compiling sqlite for a 64 bit Platform."
  1036. sqliteInt.h:119:2: warning: #warning "WARNING: If you know this is not true, please file a bugreport."
  1037. printf.c:108: warning: initialization discards qualifiers from pointer target type
  1038. printf.c:114: warning: initialization discards qualifiers from pointer target type
  1039. printf.c:114: warning: initialization discards qualifiers from pointer target type
  1040. printf.c:115: warning: initialization discards qualifiers from pointer target type
  1041. printf.c:116: warning: initialization discards qualifiers from pointer target type
  1042. printf.c:116: warning: initialization discards qualifiers from pointer target type
  1043. printf.c:117: warning: initialization discards qualifiers from pointer target type
  1044. printf.c:117: warning: initialization discards qualifiers from pointer target type
  1045. printf.c:119: warning: initialization discards qualifiers from pointer target type
  1046. printf.c:120: warning: initialization discards qualifiers from pointer target type
  1047. printf.c:121: warning: initialization discards qualifiers from pointer target type
  1048. printf.c:122: warning: initialization discards qualifiers from pointer target type
  1049. printf.c:123: warning: initialization discards qualifiers from pointer target type
  1050. printf.c:126: warning: initialization discards qualifiers from pointer target type
  1051. printf.c: In function 'vxprintf':
  1052. printf.c:308: warning: comparison between signed and unsigned
  1053. printf.c:419: warning: assignment discards qualifiers from pointer target type
  1054. printf.c:534: warning: assignment discards qualifiers from pointer target type
  1055. printf.c:544: warning: declaration of 'c' shadows a previous local
  1056. printf.c:198: warning: shadowed declaration is here
  1057. printf.c:545: warning: declaration of 'arg' shadows a parameter
  1058. printf.c:193: warning: shadowed declaration is here
  1059. printf.c:547: warning: assignment discards qualifiers from pointer target type
  1060. printf.c:609: warning: comparison between signed and unsigned
  1061. printf.c:625: warning: comparison between signed and unsigned
  1062. In file included from select.c:17:
  1063. sqliteInt.h:118:2: warning: #warning "WARNING: Compiling sqlite for a 64 bit Platform."
  1064. sqliteInt.h:119:2: warning: #warning "WARNING: If you know this is not true, please file a bugreport."
  1065. select.c: In function 'sqliteJoinType':
  1066. select.c:103: warning: comparison between signed and unsigned
  1067. select.c:110: warning: comparison between signed and unsigned
  1068. select.c:119: warning: missing initializer
  1069. select.c:119: warning: (near initialization for 'dummy.n')
  1070. select.c:120: warning: initialization discards qualifiers from pointer target type
  1071. select.c:120: warning: initialization discards qualifiers from pointer target type
  1072. select.c: In function 'sqliteProcessJoin':
  1073. select.c:267: warning: declaration of 'j' shadows a previous local
  1074. select.c:211: warning: shadowed declaration is here
  1075. select.c: In function 'generateColumnTypes':
  1076. select.c:664: warning: assignment discards qualifiers from pointer target type
  1077. select.c:670: warning: assignment discards qualifiers from pointer target type
  1078. select.c:672: warning: assignment discards qualifiers from pointer target type
  1079. select.c: In function 'generateColumnNames':
  1080. select.c:719: warning: assignment discards qualifiers from pointer target type
  1081. select.c: In function 'selectOpName':
  1082. select.c:755: warning: assignment discards qualifiers from pointer target type
  1083. select.c:756: warning: assignment discards qualifiers from pointer target type
  1084. select.c:757: warning: assignment discards qualifiers from pointer target type
  1085. select.c:758: warning: assignment discards qualifiers from pointer target type
  1086. select.c: In function 'fillInColumnList':
  1087. select.c:953: warning: declaration of 'pTab' shadows a previous local
  1088. select.c:846: warning: shadowed declaration is here
  1089. select.c: In function 'flattenSubquery':
  1090. select.c:1620: warning: unused parameter 'pParse'
  1091. select.c: In function 'multiSelect':
  1092. select.c:1336: warning: 'op' may be used uninitialized in this function
  1093. In file included from table.c:21:
  1094. sqliteInt.h:118:2: warning: #warning "WARNING: Compiling sqlite for a 64 bit Platform."
  1095. sqliteInt.h:119:2: warning: #warning "WARNING: If you know this is not true, please file a bugreport."
  1096. table.c: In function 'sqlite_get_table':
  1097. table.c:153: warning: cast to pointer from integer of different size
  1098. table.c: In function 'sqlite_free_table':
  1099. table.c:199: warning: cast from pointer to integer of different size
  1100. shell.c: In function 'one_input_line':
  1101. shell.c:156: warning: empty body in an if-statement
  1102. shell.c: At top level:
  1103. shell.c:204: warning: initialization discards qualifiers from pointer target type
  1104. shell.c:205: warning: initialization discards qualifiers from pointer target type
  1105. shell.c:206: warning: initialization discards qualifiers from pointer target type
  1106. shell.c:207: warning: initialization discards qualifiers from pointer target type
  1107. shell.c:208: warning: initialization discards qualifiers from pointer target type
  1108. shell.c:210: warning: initialization discards qualifiers from pointer target type
  1109. shell.c: In function 'interrupt_handler':
  1110. shell.c:272: warning: unused parameter 'NotUsed'
  1111. shell.c: In function 'callback':
  1112. shell.c:303: warning: comparison between signed and unsigned
  1113. shell.c:314: warning: comparison between signed and unsigned
  1114. shell.c:324: warning: comparison between signed and unsigned
  1115. shell.c:338: warning: comparison between signed and unsigned
  1116. shell.c:392: warning: initialization discards qualifiers from pointer target type
  1117. shell.c: In function 'dump_callback':
  1118. shell.c:453: warning: unused parameter 'azCol'
  1119. shell.c: In function 'do_meta_command':
  1120. shell.c:547: warning: comparison between signed and unsigned
  1121. shell.c:598: warning: declaration of 'i' shadows a previous local
  1122. shell.c:539: warning: shadowed declaration is here
  1123. shell.c:637: warning: initialization discards qualifiers from pointer target type
  1124. shell.c:695: warning: format not a string literal and no format arguments
  1125. shell.c:824: warning: assignment discards qualifiers from pointer target type
  1126. shell.c:826: warning: assignment discards qualifiers from pointer target type
  1127. shell.c:837: warning: assignment discards qualifiers from pointer target type
  1128. shell.c:839: warning: assignment discards qualifiers from pointer target type
  1129. shell.c:872: warning: declaration of 'i' shadows a previous local
  1130. shell.c:539: warning: shadowed declaration is here
  1131. shell.c:890: warning: declaration of 'rc' shadows a previous local
  1132. shell.c:542: warning: shadowed declaration is here
  1133. shell.c:920: warning: declaration of 'i' shadows a previous local
  1134. shell.c:539: warning: shadowed declaration is here
  1135. shell.c:932: warning: initialization discards qualifiers from pointer target type
  1136. shell.c:948: warning: comparison between signed and unsigned
  1137. shell.c: In function 'process_input':
  1138. shell.c:1030: warning: declaration of 'rc' shadows a previous local
  1139. shell.c:1021: warning: shadowed declaration is here
  1140. shell.c: At top level:
  1141. shell.c:1198: warning: no previous prototype for 'main_init'
  1142. shell.c: In function 'main':
  1143. shell.c:1341: warning: empty body in an if-statement
  1144. In file included from tokenize.c:20:
  1145. sqliteInt.h:118:2: warning: #warning "WARNING: Compiling sqlite for a 64 bit Platform."
  1146. sqliteInt.h:119:2: warning: #warning "WARNING: If you know this is not true, please file a bugreport."
  1147. tokenize.c:41: warning: initialization discards qualifiers from pointer target type
  1148. tokenize.c:41: warning: missing initializer
  1149. tokenize.c:41: warning: (near initialization for 'aKeywordTable[0].len')
  1150. tokenize.c:42: warning: initialization discards qualifiers from pointer target type
  1151. tokenize.c:42: warning: missing initializer
  1152. tokenize.c:42: warning: (near initialization for 'aKeywordTable[1].len')
  1153. tokenize.c:43: warning: initialization discards qualifiers from pointer target type
  1154. tokenize.c:43: warning: missing initializer
  1155. tokenize.c:43: warning: (near initialization for 'aKeywordTable[2].len')
  1156. tokenize.c:44: warning: initialization discards qualifiers from pointer target type
  1157. tokenize.c:44: warning: missing initializer
  1158. tokenize.c:44: warning: (near initialization for 'aKeywordTable[3].len')
  1159. tokenize.c:45: warning: initialization discards qualifiers from pointer target type
  1160. tokenize.c:45: warning: missing initializer
  1161. tokenize.c:45: warning: (near initialization for 'aKeywordTable[4].len')
  1162. tokenize.c:46: warning: initialization discards qualifiers from pointer target type
  1163. tokenize.c:46: warning: missing initializer
  1164. tokenize.c:46: warning: (near initialization for 'aKeywordTable[5].len')
  1165. tokenize.c:47: warning: initialization discards qualifiers from pointer target type
  1166. tokenize.c:47: warning: missing initializer
  1167. tokenize.c:47: warning: (near initialization for 'aKeywordTable[6].len')
  1168. tokenize.c:48: warning: initialization discards qualifiers from pointer target type
  1169. tokenize.c:48: warning: missing initializer
  1170. tokenize.c:48: warning: (near initialization for 'aKeywordTable[7].len')
  1171. tokenize.c:49: warning: initialization discards qualifiers from pointer target type
  1172. tokenize.c:49: warning: missing initializer
  1173. tokenize.c:49: warning: (near initialization for 'aKeywordTable[8].len')
  1174. tokenize.c:50: warning: initialization discards qualifiers from pointer target type
  1175. tokenize.c:50: warning: missing initializer
  1176. tokenize.c:50: warning: (near initialization for 'aKeywordTable[9].len')
  1177. tokenize.c:51: warning: initialization discards qualifiers from pointer target type
  1178. tokenize.c:51: warning: missing initializer
  1179. tokenize.c:51: warning: (near initialization for 'aKeywordTable[10].len')
  1180. tokenize.c:52: warning: initialization discards qualifiers from pointer target type
  1181. tokenize.c:52: warning: missing initializer
  1182. tokenize.c:52: warning: (near initialization for 'aKeywordTable[11].len')
  1183. tokenize.c:53: warning: initialization discards qualifiers from pointer target type
  1184. tokenize.c:53: warning: missing initializer
  1185. tokenize.c:53: warning: (near initialization for 'aKeywordTable[12].len')
  1186. tokenize.c:54: warning: initialization discards qualifiers from pointer target type
  1187. tokenize.c:54: warning: missing initializer
  1188. tokenize.c:54: warning: (near initialization for 'aKeywordTable[13].len')
  1189. tokenize.c:55: warning: initialization discards qualifiers from pointer target type
  1190. tokenize.c:55: warning: missing initializer
  1191. tokenize.c:55: warning: (near initialization for 'aKeywordTable[14].len')
  1192. tokenize.c:56: warning: initialization discards qualifiers from pointer target type
  1193. tokenize.c:56: warning: missing initializer
  1194. tokenize.c:56: warning: (near initialization for 'aKeywordTable[15].len')
  1195. tokenize.c:57: warning: initialization discards qualifiers from pointer target type
  1196. tokenize.c:57: warning: missing initializer
  1197. tokenize.c:57: warning: (near initialization for 'aKeywordTable[16].len')
  1198. tokenize.c:58: warning: initialization discards qualifiers from pointer target type
  1199. tokenize.c:58: warning: missing initializer
  1200. tokenize.c:58: warning: (near initialization for 'aKeywordTable[17].len')
  1201. tokenize.c:59: warning: initialization discards qualifiers from pointer target type
  1202. tokenize.c:59: warning: missing initializer
  1203. tokenize.c:59: warning: (near initialization for 'aKeywordTable[18].len')
  1204. tokenize.c:60: warning: initialization discards qualifiers from pointer target type
  1205. tokenize.c:60: warning: missing initializer
  1206. tokenize.c:60: warning: (near initialization for 'aKeywordTable[19].len')
  1207. tokenize.c:61: warning: initialization discards qualifiers from pointer target type
  1208. tokenize.c:61: warning: missing initializer
  1209. tokenize.c:61: warning: (near initialization for 'aKeywordTable[20].len')
  1210. tokenize.c:62: warning: initialization discards qualifiers from pointer target type
  1211. tokenize.c:62: warning: missing initializer
  1212. tokenize.c:62: warning: (near initialization for 'aKeywordTable[21].len')
  1213. tokenize.c:63: warning: initialization discards qualifiers from pointer target type
  1214. tokenize.c:63: warning: missing initializer
  1215. tokenize.c:63: warning: (near initialization for 'aKeywordTable[22].len')
  1216. tokenize.c:64: warning: initialization discards qualifiers from pointer target type
  1217. tokenize.c:64: warning: missing initializer
  1218. tokenize.c:64: warning: (near initialization for 'aKeywordTable[23].len')
  1219. tokenize.c:65: warning: initialization discards qualifiers from pointer target type
  1220. tokenize.c:65: warning: missing initializer
  1221. tokenize.c:65: warning: (near initialization for 'aKeywordTable[24].len')
  1222. tokenize.c:66: warning: initialization discards qualifiers from pointer target type
  1223. tokenize.c:66: warning: missing initializer
  1224. tokenize.c:66: warning: (near initialization for 'aKeywordTable[25].len')
  1225. tokenize.c:67: warning: initialization discards qualifiers from pointer target type
  1226. tokenize.c:67: warning: missing initializer
  1227. tokenize.c:67: warning: (near initialization for 'aKeywordTable[26].len')
  1228. tokenize.c:68: warning: initialization discards qualifiers from pointer target type
  1229. tokenize.c:68: warning: missing initializer
  1230. tokenize.c:68: warning: (near initialization for 'aKeywordTable[27].len')
  1231. tokenize.c:69: warning: initialization discards qualifiers from pointer target type
  1232. tokenize.c:69: warning: missing initializer
  1233. tokenize.c:69: warning: (near initialization for 'aKeywordTable[28].len')
  1234. tokenize.c:70: warning: initialization discards qualifiers from pointer target type
  1235. tokenize.c:70: warning: missing initializer
  1236. tokenize.c:70: warning: (near initialization for 'aKeywordTable[29].len')
  1237. tokenize.c:71: warning: initialization discards qualifiers from pointer target type
  1238. tokenize.c:71: warning: missing initializer
  1239. tokenize.c:71: warning: (near initialization for 'aKeywordTable[30].len')
  1240. tokenize.c:72: warning: initialization discards qualifiers from pointer target type
  1241. tokenize.c:72: warning: missing initializer
  1242. tokenize.c:72: warning: (near initialization for 'aKeywordTable[31].len')
  1243. tokenize.c:73: warning: initialization discards qualifiers from pointer target type
  1244. tokenize.c:73: warning: missing initializer
  1245. tokenize.c:73: warning: (near initialization for 'aKeywordTable[32].len')
  1246. tokenize.c:74: warning: initialization discards qualifiers from pointer target type
  1247. tokenize.c:74: warning: missing initializer
  1248. tokenize.c:74: warning: (near initialization for 'aKeywordTable[33].len')
  1249. tokenize.c:75: warning: initialization discards qualifiers from pointer target type
  1250. tokenize.c:75: warning: missing initializer
  1251. tokenize.c:75: warning: (near initialization for 'aKeywordTable[34].len')
  1252. tokenize.c:76: warning: initialization discards qualifiers from pointer target type
  1253. tokenize.c:76: warning: missing initializer
  1254. tokenize.c:76: warning: (near initialization for 'aKeywordTable[35].len')
  1255. tokenize.c:77: warning: initialization discards qualifiers from pointer target type
  1256. tokenize.c:77: warning: missing initializer
  1257. tokenize.c:77: warning: (near initialization for 'aKeywordTable[36].len')
  1258. tokenize.c:78: warning: initialization discards qualifiers from pointer target type
  1259. tokenize.c:78: warning: missing initializer
  1260. tokenize.c:78: warning: (near initialization for 'aKeywordTable[37].len')
  1261. tokenize.c:79: warning: initialization discards qualifiers from pointer target type
  1262. tokenize.c:79: warning: missing initializer
  1263. tokenize.c:79: warning: (near initialization for 'aKeywordTable[38].len')
  1264. tokenize.c:80: warning: initialization discards qualifiers from pointer target type
  1265. tokenize.c:80: warning: missing initializer
  1266. tokenize.c:80: warning: (near initialization for 'aKeywordTable[39].len')
  1267. tokenize.c:81: warning: initialization discards qualifiers from pointer target type
  1268. tokenize.c:81: warning: missing initializer
  1269. tokenize.c:81: warning: (near initialization for 'aKeywordTable[40].len')
  1270. tokenize.c:82: warning: initialization discards qualifiers from pointer target type
  1271. tokenize.c:82: warning: missing initializer
  1272. tokenize.c:82: warning: (near initialization for 'aKeywordTable[41].len')
  1273. tokenize.c:83: warning: initialization discards qualifiers from pointer target type
  1274. tokenize.c:83: warning: missing initializer
  1275. tokenize.c:83: warning: (near initialization for 'aKeywordTable[42].len')
  1276. tokenize.c:84: warning: initialization discards qualifiers from pointer target type
  1277. tokenize.c:84: warning: missing initializer
  1278. tokenize.c:84: warning: (near initialization for 'aKeywordTable[43].len')
  1279. tokenize.c:85: warning: initialization discards qualifiers from pointer target type
  1280. tokenize.c:85: warning: missing initializer
  1281. tokenize.c:85: warning: (near initialization for 'aKeywordTable[44].len')
  1282. tokenize.c:86: warning: initialization discards qualifiers from pointer target type
  1283. tokenize.c:86: warning: missing initializer
  1284. tokenize.c:86: warning: (near initialization for 'aKeywordTable[45].len')
  1285. tokenize.c:87: warning: initialization discards qualifiers from pointer target type
  1286. tokenize.c:87: warning: missing initializer
  1287. tokenize.c:87: warning: (near initialization for 'aKeywordTable[46].len')
  1288. tokenize.c:88: warning: initialization discards qualifiers from pointer target type
  1289. tokenize.c:88: warning: missing initializer
  1290. tokenize.c:88: warning: (near initialization for 'aKeywordTable[47].len')
  1291. tokenize.c:89: warning: initialization discards qualifiers from pointer target type
  1292. tokenize.c:89: warning: missing initializer
  1293. tokenize.c:89: warning: (near initialization for 'aKeywordTable[48].len')
  1294. tokenize.c:90: warning: initialization discards qualifiers from pointer target type
  1295. tokenize.c:90: warning: missing initializer
  1296. tokenize.c:90: warning: (near initialization for 'aKeywordTable[49].len')
  1297. tokenize.c:91: warning: initialization discards qualifiers from pointer target type
  1298. tokenize.c:91: warning: missing initializer
  1299. tokenize.c:91: warning: (near initialization for 'aKeywordTable[50].len')
  1300. tokenize.c:92: warning: initialization discards qualifiers from pointer target type
  1301. tokenize.c:92: warning: missing initializer
  1302. tokenize.c:92: warning: (near initialization for 'aKeywordTable[51].len')
  1303. tokenize.c:93: warning: initialization discards qualifiers from pointer target type
  1304. tokenize.c:93: warning: missing initializer
  1305. tokenize.c:93: warning: (near initialization for 'aKeywordTable[52].len')
  1306. tokenize.c:94: warning: initialization discards qualifiers from pointer target type
  1307. tokenize.c:94: warning: missing initializer
  1308. tokenize.c:94: warning: (near initialization for 'aKeywordTable[53].len')
  1309. tokenize.c:95: warning: initialization discards qualifiers from pointer target type
  1310. tokenize.c:95: warning: missing initializer
  1311. tokenize.c:95: warning: (near initialization for 'aKeywordTable[54].len')
  1312. tokenize.c:96: warning: initialization discards qualifiers from pointer target type
  1313. tokenize.c:96: warning: missing initializer
  1314. tokenize.c:96: warning: (near initialization for 'aKeywordTable[55].len')
  1315. tokenize.c:97: warning: initialization discards qualifiers from pointer target type
  1316. tokenize.c:97: warning: missing initializer
  1317. tokenize.c:97: warning: (near initialization for 'aKeywordTable[56].len')
  1318. tokenize.c:98: warning: initialization discards qualifiers from pointer target type
  1319. tokenize.c:98: warning: missing initializer
  1320. tokenize.c:98: warning: (near initialization for 'aKeywordTable[57].len')
  1321. tokenize.c:99: warning: initialization discards qualifiers from pointer target type
  1322. tokenize.c:99: warning: missing initializer
  1323. tokenize.c:99: warning: (near initialization for 'aKeywordTable[58].len')
  1324. tokenize.c:100: warning: initialization discards qualifiers from pointer target type
  1325. tokenize.c:100: warning: missing initializer
  1326. tokenize.c:100: warning: (near initialization for 'aKeywordTable[59].len')
  1327. tokenize.c:101: warning: initialization discards qualifiers from pointer target type
  1328. tokenize.c:101: warning: missing initializer
  1329. tokenize.c:101: warning: (near initialization for 'aKeywordTable[60].len')
  1330. tokenize.c:102: warning: initialization discards qualifiers from pointer target type
  1331. tokenize.c:102: warning: missing initializer
  1332. tokenize.c:102: warning: (near initialization for 'aKeywordTable[61].len')
  1333. tokenize.c:103: warning: initialization discards qualifiers from pointer target type
  1334. tokenize.c:103: warning: missing initializer
  1335. tokenize.c:103: warning: (near initialization for 'aKeywordTable[62].len')
  1336. tokenize.c:104: warning: initialization discards qualifiers from pointer target type
  1337. tokenize.c:104: warning: missing initializer
  1338. tokenize.c:104: warning: (near initialization for 'aKeywordTable[63].len')
  1339. tokenize.c:105: warning: initialization discards qualifiers from pointer target type
  1340. tokenize.c:105: warning: missing initializer
  1341. tokenize.c:105: warning: (near initialization for 'aKeywordTable[64].len')
  1342. tokenize.c:106: warning: initialization discards qualifiers from pointer target type
  1343. tokenize.c:106: warning: missing initializer
  1344. tokenize.c:106: warning: (near initialization for 'aKeywordTable[65].len')
  1345. tokenize.c:107: warning: initialization discards qualifiers from pointer target type
  1346. tokenize.c:107: warning: missing initializer
  1347. tokenize.c:107: warning: (near initialization for 'aKeywordTable[66].len')
  1348. tokenize.c:108: warning: initialization discards qualifiers from pointer target type
  1349. tokenize.c:108: warning: missing initializer
  1350. tokenize.c:108: warning: (near initialization for 'aKeywordTable[67].len')
  1351. tokenize.c:109: warning: initialization discards qualifiers from pointer target type
  1352. tokenize.c:109: warning: missing initializer
  1353. tokenize.c:109: warning: (near initialization for 'aKeywordTable[68].len')
  1354. tokenize.c:110: warning: initialization discards qualifiers from pointer target type
  1355. tokenize.c:110: warning: missing initializer
  1356. tokenize.c:110: warning: (near initialization for 'aKeywordTable[69].len')
  1357. tokenize.c:111: warning: initialization discards qualifiers from pointer target type
  1358. tokenize.c:111: warning: missing initializer
  1359. tokenize.c:111: warning: (near initialization for 'aKeywordTable[70].len')
  1360. tokenize.c:112: warning: initialization discards qualifiers from pointer target type
  1361. tokenize.c:112: warning: missing initializer
  1362. tokenize.c:112: warning: (near initialization for 'aKeywordTable[71].len')
  1363. tokenize.c:113: warning: initialization discards qualifiers from pointer target type
  1364. tokenize.c:113: warning: missing initializer
  1365. tokenize.c:113: warning: (near initialization for 'aKeywordTable[72].len')
  1366. tokenize.c:114: warning: initialization discards qualifiers from pointer target type
  1367. tokenize.c:114: warning: missing initializer
  1368. tokenize.c:114: warning: (near initialization for 'aKeywordTable[73].len')
  1369. tokenize.c:115: warning: initialization discards qualifiers from pointer target type
  1370. tokenize.c:115: warning: missing initializer
  1371. tokenize.c:115: warning: (near initialization for 'aKeywordTable[74].len')
  1372. tokenize.c:116: warning: initialization discards qualifiers from pointer target type
  1373. tokenize.c:116: warning: missing initializer
  1374. tokenize.c:116: warning: (near initialization for 'aKeywordTable[75].len')
  1375. tokenize.c:117: warning: initialization discards qualifiers from pointer target type
  1376. tokenize.c:117: warning: missing initializer
  1377. tokenize.c:117: warning: (near initialization for 'aKeywordTable[76].len')
  1378. tokenize.c:118: warning: initialization discards qualifiers from pointer target type
  1379. tokenize.c:118: warning: missing initializer
  1380. tokenize.c:118: warning: (near initialization for 'aKeywordTable[77].len')
  1381. tokenize.c:119: warning: initialization discards qualifiers from pointer target type
  1382. tokenize.c:119: warning: missing initializer
  1383. tokenize.c:119: warning: (near initialization for 'aKeywordTable[78].len')
  1384. tokenize.c:120: warning: initialization discards qualifiers from pointer target type
  1385. tokenize.c:120: warning: missing initializer
  1386. tokenize.c:120: warning: (near initialization for 'aKeywordTable[79].len')
  1387. tokenize.c:121: warning: initialization discards qualifiers from pointer target type
  1388. tokenize.c:121: warning: missing initializer
  1389. tokenize.c:121: warning: (near initialization for 'aKeywordTable[80].len')
  1390. tokenize.c:122: warning: initialization discards qualifiers from pointer target type
  1391. tokenize.c:122: warning: missing initializer
  1392. tokenize.c:122: warning: (near initialization for 'aKeywordTable[81].len')
  1393. tokenize.c:123: warning: initialization discards qualifiers from pointer target type
  1394. tokenize.c:123: warning: missing initializer
  1395. tokenize.c:123: warning: (near initialization for 'aKeywordTable[82].len')
  1396. tokenize.c:124: warning: initialization discards qualifiers from pointer target type
  1397. tokenize.c:124: warning: missing initializer
  1398. tokenize.c:124: warning: (near initialization for 'aKeywordTable[83].len')
  1399. tokenize.c:125: warning: initialization discards qualifiers from pointer target type
  1400. tokenize.c:125: warning: missing initializer
  1401. tokenize.c:125: warning: (near initialization for 'aKeywordTable[84].len')
  1402. tokenize.c:126: warning: initialization discards qualifiers from pointer target type
  1403. tokenize.c:126: warning: missing initializer
  1404. tokenize.c:126: warning: (near initialization for 'aKeywordTable[85].len')
  1405. tokenize.c:127: warning: initialization discards qualifiers from pointer target type
  1406. tokenize.c:127: warning: missing initializer
  1407. tokenize.c:127: warning: (near initialization for 'aKeywordTable[86].len')
  1408. tokenize.c:128: warning: initialization discards qualifiers from pointer target type
  1409. tokenize.c:128: warning: missing initializer
  1410. tokenize.c:128: warning: (near initialization for 'aKeywordTable[87].len')
  1411. tokenize.c:129: warning: initialization discards qualifiers from pointer target type
  1412. tokenize.c:129: warning: missing initializer
  1413. tokenize.c:129: warning: (near initialization for 'aKeywordTable[88].len')
  1414. tokenize.c:130: warning: initialization discards qualifiers from pointer target type
  1415. tokenize.c:130: warning: missing initializer
  1416. tokenize.c:130: warning: (near initialization for 'aKeywordTable[89].len')
  1417. tokenize.c:131: warning: initialization discards qualifiers from pointer target type
  1418. tokenize.c:131: warning: missing initializer
  1419. tokenize.c:131: warning: (near initialization for 'aKeywordTable[90].len')
  1420. tokenize.c:132: warning: initialization discards qualifiers from pointer target type
  1421. tokenize.c:132: warning: missing initializer
  1422. tokenize.c:132: warning: (near initialization for 'aKeywordTable[91].len')
  1423. tokenize.c:133: warning: initialization discards qualifiers from pointer target type
  1424. tokenize.c:133: warning: missing initializer
  1425. tokenize.c:133: warning: (near initialization for 'aKeywordTable[92].len')
  1426. tokenize.c:134: warning: initialization discards qualifiers from pointer target type
  1427. tokenize.c:134: warning: missing initializer
  1428. tokenize.c:134: warning: (near initialization for 'aKeywordTable[93].len')
  1429. tokenize.c:135: warning: initialization discards qualifiers from pointer target type
  1430. tokenize.c:135: warning: missing initializer
  1431. tokenize.c:135: warning: (near initialization for 'aKeywordTable[94].len')
  1432. tokenize.c:136: warning: initialization discards qualifiers from pointer target type
  1433. tokenize.c:136: warning: missing initializer
  1434. tokenize.c:136: warning: (near initialization for 'aKeywordTable[95].len')
  1435. tokenize.c:137: warning: initialization discards qualifiers from pointer target type
  1436. tokenize.c:137: warning: missing initializer
  1437. tokenize.c:137: warning: (near initialization for 'aKeywordTable[96].len')
  1438. tokenize.c:138: warning: initialization discards qualifiers from pointer target type
  1439. tokenize.c:138: warning: missing initializer
  1440. tokenize.c:138: warning: (near initialization for 'aKeywordTable[97].len')
  1441. tokenize.c:139: warning: initialization discards qualifiers from pointer target type
  1442. tokenize.c:139: warning: missing initializer
  1443. tokenize.c:139: warning: (near initialization for 'aKeywordTable[98].len')
  1444. tokenize.c:140: warning: initialization discards qualifiers from pointer target type
  1445. tokenize.c:140: warning: missing initializer
  1446. tokenize.c:140: warning: (near initialization for 'aKeywordTable[99].len')
  1447. In file included from trigger.c:13:
  1448. sqliteInt.h:118:2: warning: #warning "WARNING: Compiling sqlite for a 64 bit Platform."
  1449. sqliteInt.h:119:2: warning: #warning "WARNING: If you know this is not true, please file a bugreport."
  1450. trigger.c: In function 'sqliteFinishTrigger':
  1451. trigger.c:187: warning: initialization discards qualifiers from pointer target type
  1452. trigger.c: In function 'sqliteDropTriggerPtr':
  1453. trigger.c:458: warning: initialization discards qualifiers from pointer target type
  1454. trigger.c: In function 'sqliteDropTrigger':
  1455. trigger.c:389: warning: 'pTrigger' may be used uninitialized in this function
  1456. In file included from util.c:19:
  1457. sqliteInt.h:118:2: warning: #warning "WARNING: Compiling sqlite for a 64 bit Platform."
  1458. sqliteInt.h:119:2: warning: #warning "WARNING: If you know this is not true, please file a bugreport."
  1459. util.c: In function 'sqliteSafetyOn':
  1460. util.c:1092: warning: comparison between signed and unsigned
  1461. util.c:1095: warning: comparison between signed and unsigned
  1462. util.c:1096: warning: comparison between signed and unsigned
  1463. util.c: In function 'sqliteSafetyOff':
  1464. util.c:1109: warning: comparison between signed and unsigned
  1465. util.c:1112: warning: comparison between signed and unsigned
  1466. util.c:1113: warning: comparison between signed and unsigned
  1467. In file included from update.c:17:
  1468. sqliteInt.h:118:2: warning: #warning "WARNING: Compiling sqlite for a 64 bit Platform."
  1469. sqliteInt.h:119:2: warning: #warning "WARNING: If you know this is not true, please file a bugreport."
  1470. update.c: In function 'sqliteUpdate':
  1471. update.c:50: warning: 'pRecnoExpr' may be used uninitialized in this function
  1472. update.c:36: warning: 'jumpInst' may be used uninitialized in this function
  1473. update.c:35: warning: 'loopStart' may be used uninitialized in this function
  1474. update.c:51: warning: 'openAll' may be used uninitialized in this function
  1475. In file included from vdbe.c:48:
  1476. sqliteInt.h:118:2: warning: #warning "WARNING: Compiling sqlite for a 64 bit Platform."
  1477. sqliteInt.h:119:2: warning: #warning "WARNING: If you know this is not true, please file a bugreport."
  1478. In file included from vacuum.c:19:
  1479. sqliteInt.h:118:2: warning: #warning "WARNING: Compiling sqlite for a 64 bit Platform."
  1480. sqliteInt.h:119:2: warning: #warning "WARNING: If you know this is not true, please file a bugreport."
  1481. vdbe.c: In function 'sqlite_step':
  1482. vdbe.c:117: warning: comparison between signed and unsigned
  1483. vdbe.c: In function '_AggInFocus':
  1484. vdbe.c:186: warning: passing argument 2 of 'AggInsert' discards qualifiers from pointer target type
  1485. vdbe.c: In function 'sqliteVdbeExec':
  1486. vdbe.c:502: warning: comparison between signed and unsigned
  1487. vdbe.c:616: warning: comparison between signed and unsigned
  1488. vdbe.c:912: warning: assignment discards qualifiers from pointer target type
  1489. vdbe.c:2697: warning: declaration of 'rc' shadows a previous local
  1490. vdbe.c:490: warning: shadowed declaration is here
  1491. vdbe.c:3519: warning: comparison between signed and unsigned
  1492. vdbe.c:3567: warning: declaration of 'rc' shadows a previous local
  1493. vdbe.c:490: warning: shadowed declaration is here
  1494. vdbe.c:3741: warning: assignment discards qualifiers from pointer target type
  1495. vdbe.c:4194: warning: declaration of 'c' shadows a previous local
  1496. vdbe.c:4163: warning: shadowed declaration is here
  1497. vdbe.c:4215: warning: assignment discards qualifiers from pointer target type
  1498. vdbe.c:4254: warning: assignment discards qualifiers from pointer target type
  1499. vdbe.c:4909: warning: comparison between signed and unsigned
  1500. vacuum.c: In function 'vacuumCallback2':
  1501. vacuum.c:109: warning: unused parameter 'NotUsed'
  1502. vacuum.c: In function 'vacuumCallback1':
  1503. vacuum.c:141: warning: unused parameter 'argc'
  1504. vacuum.c:141: warning: unused parameter 'NotUsed'
  1505. vacuum.c: In function 'vacuumCallback3':
  1506. vacuum.c:171: warning: unused parameter 'argc'
  1507. vacuum.c:171: warning: unused parameter 'NotUsed'
  1508. vacuum.c: In function 'sqliteVacuum':
  1509. vacuum.c:209: warning: unused parameter 'pTableName'
  1510. vacuum.c: In function 'sqliteRunVacuum':
  1511. vacuum.c:286: warning: comparison between signed and unsigned
  1512. In file included from vdbeaux.c:17:
  1513. sqliteInt.h:118:2: warning: #warning "WARNING: Compiling sqlite for a 64 bit Platform."
  1514. sqliteInt.h:119:2: warning: #warning "WARNING: If you know this is not true, please file a bugreport."
  1515. vdbeaux.c: In function 'sqliteVdbeList':
  1516. vdbeaux.c:540: warning: initialization discards qualifiers from pointer target type
  1517. vdbeaux.c:540: warning: initialization discards qualifiers from pointer target type
  1518. vdbeaux.c:540: warning: initialization discards qualifiers from pointer target type
  1519. vdbeaux.c:540: warning: initialization discards qualifiers from pointer target type
  1520. vdbeaux.c:540: warning: initialization discards qualifiers from pointer target type
  1521. vdbeaux.c:541: warning: initialization discards qualifiers from pointer target type
  1522. vdbeaux.c:541: warning: initialization discards qualifiers from pointer target type
  1523. vdbeaux.c:541: warning: initialization discards qualifiers from pointer target type
  1524. vdbeaux.c:541: warning: initialization discards qualifiers from pointer target type
  1525. vdbeaux.c:541: warning: initialization discards qualifiers from pointer target type
  1526. vdbeaux.c:556: warning: comparison between signed and unsigned
  1527. vdbeaux.c:568: warning: cast from pointer to integer of different size
  1528. vdbeaux.c: In function 'sqliteVdbeReset':
  1529. vdbeaux.c:838: warning: comparison between signed and unsigned
  1530. vdbeaux.c: In function 'sqliteVdbeFinalize':
  1531. vdbeaux.c:924: warning: comparison between signed and unsigned
  1532. vdbeaux.c: In function 'sqlite_bind':
  1533. vdbeaux.c:950: warning: comparison between signed and unsigned
  1534. In file included from where.c:17:
  1535. sqliteInt.h:118:2: warning: #warning "WARNING: Compiling sqlite for a 64 bit Platform."
  1536. sqliteInt.h:119:2: warning: #warning "WARNING: If you know this is not true, please file a bugreport."
  1537. where.c: In function 'getMask':
  1538. where.c:97: warning: comparison between signed and unsigned
  1539. where.c: In function 'sqliteWhereBegin':
  1540. where.c:451: warning: comparison between signed and unsigned
  1541. where.c:708: warning: comparison between signed and unsigned
  1542. where.c:836: warning: comparison between signed and unsigned
  1543. where.c:920: warning: 'geFlag' may be used uninitialized in this function
  1544. where.c:920: warning: 'leFlag' may be used uninitialized in this function
  1545. where.c:362: warning: 'haveKey' may be used uninitialized in this function
  1546. vdbe.c:3124: warning: 'pCrsr' may be used uninitialized in this function
  1547. vdbe.c:3122: warning: 'pC' may be used uninitialized in this function
  1548. vdbe.c:2835: warning: 'rx' may be used uninitialized in this function
  1549. Making all in libs
  1550. Making all in lprof
  1551. mkdir: cannot create directory `.libs': File exists
  1552. lcmsprf.h:79: error: 'BOOL' does not name a type
  1553. lcmsprf.h:96: error: 'BOOL' does not name a type
  1554. lcmsprf.h:98: error: 'BOOL' does not name a type
  1555. lcmsprf.h:100: error: 'BOOL' does not name a type
  1556. lcmsprf.h:101: error: 'BOOL' does not name a type
  1557. lcmsprf.h:106: error: 'BOOL' does not name a type
  1558. lcmsprf.h:108: error: 'BOOL' does not name a type
  1559. lcmsprf.h:110: error: 'BOOL' does not name a type
  1560. lcmsprf.h:114: error: 'BOOL' does not name a type
  1561. lcmsprf.h:116: error: 'BOOL' does not name a type
  1562. lcmsprf.h:120: error: 'BOOL' does not name a type
  1563. lcmsprf.h:180: error: expected initializer before '*' token
  1564. lcmsprf.h:188: error: 'SETOFPATCHES' does not name a type
  1565. lcmsprf.h:194: error: 'SETOFPATCHES' does not name a type
  1566. lcmsprf.h:196: error: 'BOOL' does not name a type
  1567. lcmsprf.h:201: error: 'SETOFPATCHES' has not been declared
  1568. lcmsprf.h:202: error: 'BOOL' does not name a type
  1569. lcmsprf.h:204: error: 'BOOL' does not name a type
  1570. lcmsprf.h:205: error: 'BOOL' does not name a typelcmsprf.h:79: error: 'BOOL' does not name a type
  1571. lcmsprf.h:96: error: 'BOOL' does not name a type
  1572. lcmsprf.h:98: error: 'BOOL' does not name a type
  1573. lcmsprf.h:100: error: 'BOOL' does not name a type
  1574. lcmsprf.h:101: error: 'BOOL' does not name a type
  1575. lcmsprf.h:106: error: 'BOOL' does not name a type
  1576. lcmsprf.h:108: error: 'BOOL' does not name a type
  1577. lcmsprf.h:110: error: 'BOOL' does not name a type
  1578. lcmsprf.h:114: error: 'BOOL' does not name a type
  1579. lcmsprf.h:116: error: 'BOOL' does not name a type
  1580. lcmsprf.h:120: error: 'BOOL' does not name a type
  1581.  
  1582. lcmsprf.h:180: error: expected initializer before '*' token
  1583. lcmsprf.h:188: error: 'SETOFPATCHES' does not name a type
  1584. lcmsprf.h:194: error: 'SETOFPATCHES' does not name a type
  1585. lcmsprf.h:196: error: 'BOOL' does not name a type
  1586. lcmsprf.h:201: error: 'SETOFPATCHES' has not been declared
  1587. lcmsprf.h:202: error: 'BOOL' does not name a type
  1588. lcmsprf.h:204: error: 'BOOL' does not name a type
  1589. lcmsprf.h:205: error: 'BOOL' does not name a type
  1590. lcmsprf.h:214: error: 'SETOFPATCHES' has not been declared
  1591. lcmsprf.h:214: error: 'SETOFPATCHES' has not been declared
  1592. lcmsprf.h:222: error: 'SETOFPATCHES' has not been declared
  1593. lcmsprf.h:224: error: 'SETOFPATCHES' has not been declared
  1594. lcmsprf.h:225: error: 'SETOFPATCHES' has not been declared
  1595. lcmsprf.h:227: error: 'SETOFPATCHES' has not been declared
  1596. lcmsprf.h:228: error: 'SETOFPATCHES' has not been declared
  1597. lcmsprf.h:230: error: 'SETOFPATCHES' has not been declared
  1598. lcmsprf.h:231: error: 'SETOFPATCHES' has not been declared
  1599. lcmsprf.h:233: error: 'SETOFPATCHES' has not been declared
  1600. lcmsprf.h:234: error: 'SETOFPATCHES' has not been declared
  1601. lcmsprf.h:236: error: 'SETOFPATCHES' has not been declaredlcmsprf.h:222: error: 'SETOFPATCHES' has not been declared
  1602.  
  1603. lcmsprf.h:237: error: 'SETOFPATCHES' has not been declared
  1604. lcmsprf.h:241: error: 'SETOFPATCHES' has not been declared
  1605. lcmsprf.h:242: error: 'SETOFPATCHES' has not been declared
  1606. lcmsprf.h:243: error: 'SETOFPATCHES' has not been declared
  1607. lcmsprf.h:224: error: 'SETOFPATCHES' has not been declared
  1608. lcmsprf.h:225: error: 'SETOFPATCHES' has not been declared
  1609. lcmsprf.h:270: error: 'SETOFPATCHES' has not been declared
  1610. lcmsprf.h:274: error: 'BOOL' does not name a type
  1611. lcmsprf.h:277: error: 'BOOL' does not name a type
  1612. lcmsprf.h:280: error: 'BOOL' does not name a type
  1613. lcmsprf.h:227: error: 'SETOFPATCHES' has not been declared
  1614. lcmsprf.h:300: error: 'BOOL' does not name a typelcmsprf.h:228: error: 'SETOFPATCHES' has not been declared
  1615. lcmsprf.h:301: error: 'BOOL' does not name a type
  1616. lcmsprf.h:308: error: 'BOOL' does not name a type
  1617. lcmsprf.h:309: error: 'BOOL' does not name a type
  1618.  
  1619. lcmsprf.h:230: error: 'SETOFPATCHES' has not been declared
  1620. lcmsprf.h:231: error: 'SETOFPATCHES' has not been declared
  1621. lcmsprf.h:233: error: 'SETOFPATCHES' has not been declared
  1622. lcmsprf.h:234: error: 'SETOFPATCHES' has not been declared
  1623. lcmsprf.h:236: error: 'SETOFPATCHES' has not been declared
  1624. lcmsprf.h:237: error: 'SETOFPATCHES' has not been declared
  1625. lcmsprf.h:241: error: 'SETOFPATCHES' has not been declared
  1626. lcmsprf.h:242: error: 'SETOFPATCHES' has not been declared
  1627. lcmsprf.h:243: error: 'SETOFPATCHES' has not been declared
  1628. lcmsprf.h:311: error: 'BOOL' does not name a type
  1629. lcmsprf.h:327: error: 'SETOFPATCHES' has not been declared
  1630. lcmsprf.h:342: error: 'BOOL' does not name a type
  1631. lcmsprf.h:270: error: 'SETOFPATCHES' has not been declared
  1632. lcmsprf.h:274: error: 'BOOL' does not name a type
  1633. lcmsprf.h:277: error: 'BOOL' does not name a type
  1634. lcmsprf.h:401: error: 'BOOL' does not name a type
  1635. lcmsprf.h:280: error: 'BOOL' does not name a type
  1636. lcmsprf.h:415: error: 'BOOL' does not name a type
  1637. lcmsprf.h:416: error: 'BOOL' does not name a type
  1638. lcmsprf.h:417: error: 'BOOL' does not name a type
  1639. lcmsprf.h:419: error: 'BOOL' has not been declared
  1640. lcmsprf.h:420: error: 'BOOL' has not been declared
  1641. lcmsprf.h:423: error: 'BOOL' does not name a type
  1642. lcmsprf.h:300: error: 'BOOL' does not name a type
  1643. lcmsprf.h:301: error: 'BOOL' does not name a typelcmsprf.h:446: error: 'BOOL' does not name a type
  1644. lcmsprf.h:447: error: 'BOOL' does not name a type
  1645. lcmsprf.h:462: error: 'BOOL' does not name a type
  1646. lcmsprf.h:470: error: 'BOOL' does not name a type
  1647. lcmsprf.h:471: error: 'BOOL' does not name a type
  1648. cmshull.cpp:44: error: 'BOOL' does not name a type
  1649. cmshull.cpp:45: error: 'BOOL' does not name a type
  1650. cmshull.cpp:47: error: 'BOOL' does not name a type
  1651. cmshull.cpp:105: error: 'BOOL' does not name a type
  1652. cmshull.cpp:114: error: 'BOOL' does not name a type
  1653. cmshull.cpp:124: error: 'BOOL' does not name a type
  1654. cmshull.cpp:125: error: 'BOOL' does not name a type
  1655. cmshull.cpp: In function '_vertex_struct* MakeNullVertex(HULL*)':
  1656. cmshull.cpp:180: error: 'struct _vertex_struct' has no member named 'onhull'
  1657. cmshull.cpp:181: error: 'struct _vertex_struct' has no member named 'mark'
  1658. cmshull.cpp: In function '_edge_struct* MakeNullEdge(HULL*)':
  1659. cmshull.cpp:203: error: 'struct _edge_struct' has no member named 'DoDelete'
  1660. cmshull.cpp: In function '_face_struct* MakeNullFace(HULL*)':
  1661. cmshull.cpp:226: error: 'struct _face_struct' has no member named 'Visible'
  1662. cmshull.cpp: At global scope:
  1663. cmshull.cpp:274: error: 'BOOL' does not name a type
  1664. cmshull.cpp: In function 'void CleanEdges(HULL*)':
  1665. cmshull.cpp:338: error: 'struct _face_struct' has no member named 'Visible'
  1666. cmshull.cpp:351: error: 'struct _edge_struct' has no member named 'DoDelete'
  1667. cmshull.cpp:361: error: 'struct _edge_struct' has no member named 'DoDelete'
  1668. cmshull.cpp: In function 'void CleanFaces(HULL*)':
  1669. cmshull.cpp:382: error: 'struct _face_struct' has no member named 'Visible'
  1670. cmshull.cpp:391: error: 'struct _face_struct' has no member named 'Visible'
  1671. cmshull.cpp: In function 'void CleanVertices(HULL*)':
  1672. cmshull.cpp:419: error: 'struct _vertex_struct' has no member named 'onhull'
  1673. cmshull.cpp:419: error: 'struct _vertex_struct' has no member named 'onhull'
  1674. cmshull.cpp:428: error: 'struct _vertex_struct' has no member named 'mark'
  1675. cmshull.cpp:428: error: 'struct _vertex_struct' has no member named 'onhull'
  1676. cmshull.cpp:437: error: 'struct _vertex_struct' has no member named 'mark'
  1677. cmshull.cpp:437: error: 'struct _vertex_struct' has no member named 'onhull'
  1678. cmshull.cpp:453: error: 'struct _vertex_struct' has no member named 'onhull'
  1679. cmshull.cpp: In function 'void MakeCcw(_face_struct*, _edge_struct*, _vertex_struct*)':
  1680. cmshull.cpp:482: error: 'struct _face_struct' has no member named 'Visible'
  1681. cmshull.cpp: At global scope:
  1682. cmshull.cpp:568: error: 'BOOL' does not name a type
  1683. cmshull.cpp:637: error: 'BOOL' does not name a type
  1684. cmshull.cpp: In function 'void ConstructHull(HULL*)':
  1685. cmshull.cpp:696: error: 'BOOL' was not declared in this scope
  1686. cmshull.cpp:696: error: expected `;' before 'changed'
  1687. cmshull.cpp:703: error: 'changed' was not declared in this scope
  1688. cmshull.cpp:705: error: 'struct _vertex_struct' has no member named 'mark'
  1689. cmshull.cpp:707: error: 'struct _vertex_struct' has no member named 'mark'
  1690. cmshull.cpp:708: error: 'AddOne' was not declared in this scope
  1691. cmshull.cpp: At global scope:
  1692. cmshull.cpp:1311: error: 'BOOL' does not name a type
  1693. cmshull.cpp:1326: error: 'BOOL' does not name a type
  1694. cmshull.cpp:1351: error: 'BOOL' does not name a type
  1695.  
  1696. lcmsprf.h:308: error: 'BOOL' does not name a type
  1697. lcmsprf.h:309: error: 'BOOL' does not name a type
  1698. lcmsprf.h:311: error: 'BOOL' does not name a type
  1699. lcmsprf.h:327: error: 'SETOFPATCHES' has not been declared
  1700. lcmsprf.h:342: error: 'BOOL' does not name a type
  1701. lcmsprf.h:401: error: 'BOOL' does not name a type
  1702. lcmsprf.h:415: error: 'BOOL' does not name a type
  1703. lcmsprf.h:416: error: 'BOOL' does not name a type
  1704. lcmsprf.h:417: error: 'BOOL' does not name a type
  1705. lcmsprf.h:419: error: 'BOOL' has not been declared
  1706. lcmsprf.h:420: error: 'BOOL' has not been declared
  1707. lcmsprf.h:423: error: 'BOOL' does not name a type
  1708. lcmsprf.h:446: error: 'BOOL' does not name a type
  1709. lcmsprf.h:447: error: 'BOOL' does not name a type
  1710. lcmsprf.h:462: error: 'BOOL' does not name a type
  1711. lcmsprf.h:470: error: 'BOOL' does not name a type
  1712. lcmsprf.h:471: error: 'BOOL' does not name a type
  1713. cmslm.cpp:72: error: 'BOOL' does not name a type
  1714. cmslm.cpp:73: error: 'BOOL' does not name a type
  1715. cmslm.cpp:215: error: 'BOOL' does not name a type
  1716. cmslm.cpp:226: error: 'BOOL' does not name a type
  1717. lcmsprf.h:79: error: 'BOOL' does not name a type
  1718. lcmsprf.h:96: error: 'BOOL' does not name a type
  1719. lcmsprf.h:98: error: 'BOOL' does not name a type
  1720. lcmsprf.h:100: error: 'BOOL' does not name a type
  1721. lcmsprf.h:101: error: 'BOOL' does not name a type
  1722. lcmsprf.h:106: error: 'BOOL' does not name a type
  1723. lcmsprf.h:108: error: 'BOOL' does not name a type
  1724. lcmsprf.h:110: error: 'BOOL' does not name a type
  1725. lcmsprf.h:114: error: 'BOOL' does not name a type
  1726. lcmsprf.h:116: error: 'BOOL' does not name a type
  1727. lcmsprf.h:120: error: 'BOOL' does not name a type
  1728. lcmsprf.h:180: error: expected initializer before '*' token
  1729. lcmsprf.h:188: error: 'SETOFPATCHES' does not name a type
  1730. lcmsprf.h:194: error: 'SETOFPATCHES' does not name a type
  1731. lcmsprf.h:196: error: 'BOOL' does not name a type
  1732. lcmsprf.h:201: error: 'SETOFPATCHES' has not been declared
  1733. lcmsprf.h:202: error: 'BOOL' does not name a type
  1734. lcmsprf.h:204: error: 'BOOL' does not name a type
  1735. lcmsprf.h:205: error: 'BOOL' does not name a type
  1736. lcmsprf.h:214: error: 'SETOFPATCHES' has not been declared
  1737. lcmsprf.h:222: error: 'SETOFPATCHES' has not been declared
  1738. lcmsprf.h:224: error: 'SETOFPATCHES' has not been declared
  1739. lcmsprf.h:225: error: 'SETOFPATCHES' has not been declared
  1740. lcmsprf.h:227: error: 'SETOFPATCHES' has not been declared
  1741. lcmsprf.h:228: error: 'SETOFPATCHES' has not been declared
  1742. lcmsprf.h:230: error: 'SETOFPATCHES' has not been declared
  1743. lcmsprf.h:231: error: 'SETOFPATCHES' has not been declared
  1744. lcmsprf.h:233: error: 'SETOFPATCHES' has not been declared
  1745. lcmsprf.h:234: error: 'SETOFPATCHES' has not been declared
  1746. lcmsprf.h:236: error: 'SETOFPATCHES' has not been declared
  1747. lcmsprf.h:237: error: 'SETOFPATCHES' has not been declared
  1748. lcmsprf.h:241: error: 'SETOFPATCHES' has not been declared
  1749. lcmsprf.h:242: error: 'SETOFPATCHES' has not been declared
  1750. lcmsprf.h:243: error: 'SETOFPATCHES' has not been declared
  1751. lcmsprf.h:270: error: 'SETOFPATCHES' has not been declared
  1752. lcmsprf.h:274: error: 'BOOL' does not name a type
  1753. lcmsprf.h:277: error: 'BOOL' does not name a type
  1754. lcmsprf.h:280: error: 'BOOL' does not name a type
  1755. lcmsprf.h:300: error: 'BOOL' does not name a type
  1756. lcmsprf.h:301: error: 'BOOL' does not name a type
  1757. lcmsprf.h:308: error: 'BOOL' does not name a type
  1758. lcmsprf.h:309: error: 'BOOL' does not name a type
  1759. lcmsprf.h:311: error: 'BOOL' does not name a type
  1760. lcmsprf.h:327: error: 'SETOFPATCHES' has not been declared
  1761. lcmsprf.h:342: error: 'BOOL' does not name a type
  1762. lcmsprf.h:401: error: 'BOOL' does not name a type
  1763. lcmsprf.h:415: error: 'BOOL' does not name a type
  1764. lcmsprf.h:416: error: 'BOOL' does not name a type
  1765. lcmsprf.h:417: error: 'BOOL' does not name a type
  1766. lcmsprf.h:419: error: 'BOOL' has not been declared
  1767. lcmsprf.h:420: error: 'BOOL' has not been declared
  1768. lcmsprf.h:423: error: 'BOOL' does not name a type
  1769. lcmsprf.h:446: error: 'BOOL' does not name a type
  1770. lcmsprf.h:447: error: 'BOOL' does not name a type
  1771. lcmsprf.h:462: error: 'BOOL' does not name a type
  1772. lcmsprf.h:470: error: 'BOOL' does not name a type
  1773. lcmsprf.h:471: error: 'BOOL' does not name a type
  1774. cmslnr.cpp:42: error: 'SETOFPATCHES' has not been declared
  1775. cmslnr.cpp:110: error: 'BOOL' has not been declared
  1776. cmslnr.cpp:189: error: 'BOOL' does not name a type
  1777. cmslnr.cpp: In function 'GAMMATABLE* cmsxEstimateGamma(SAMPLEDCURVE*, SAMPLEDCURVE*, int)':
  1778. cmslnr.cpp:249: error: 'OneTry' was not declared in this scope
  1779. cmslnr.cpp:263: error: 'OneTry' was not declared in this scope
  1780. cmslnr.cpp: In function 'void Bubble(SAMPLEDCURVE*, SAMPLEDCURVE*)':
  1781. cmslnr.cpp:283: error: 'BOOL' was not declared in this scope
  1782. cmslnr.cpp:283: error: expected `;' before 'lSwapped'
  1783. cmslnr.cpp:289: error: 'lSwapped' was not declared in this scope
  1784. cmslnr.cpp:301: error: 'lSwapped' was not declared in this scope
  1785. cmslnr.cpp: At global scope:
  1786. cmslnr.cpp:389: error: 'SETOFPATCHES' has not been declared
  1787. cmslnr.cpp: In function 'void cmsxCompleteLabOfPatches(_measurement*, int, int)':
  1788. cmslnr.cpp:415: error: invalid types 'int[int]' for array subscript
  1789. cmslnr.cpp: In function 'void cmsxComputeLinearizationTables(_measurement*, int, GAMMATABLE**, int, int)':
  1790. cmslnr.cpp:443: error: 'SETOFPATCHES' was not declared in this scope
  1791. cmslnr.cpp:443: error: expected `;' before 'Neutrals'
  1792. cmslnr.cpp:448: error: 'struct _measurement' has no member named 'Allowed'
  1793. cmslnr.cpp:451: error: 'Neutrals' was not declared in this scope
  1794. cmslnr.cpp:451: error: 'cmsxPCollBuildSet' was not declared in this scope
  1795. cmslnr.cpp:452: error: 'struct _measurement' has no member named 'Allowed'
  1796. make[4]: *** [liblprof_la-cmshull.lo] Error 1
  1797. make[4]: *** Waiting for unfinished jobs....
  1798. make[4]: *** [liblprof_la-cmslm.lo] Error 1
  1799. make[4]: *** [liblprof_la-cmslnr.lo] Error 1
  1800. make[3]: *** [all-recursive] Error 1
  1801. make[2]: *** [all-recursive] Error 1
  1802. make[1]: *** [all-recursive] Error 1
  1803. make: *** [all] Error 2
  1804.  
  1805. !!! ERROR: media-gfx/digikam-0.9.2 failed.
  1806. Call stack:
  1807.   ebuild.sh, line 1614:   Called dyn_compile
  1808.   ebuild.sh, line 971:   Called qa_call 'src_compile'
  1809.   environment, line 4886:   Called src_compile
  1810.   digikam-0.9.2.ebuild, line 79:   Called kde_src_compile
  1811.   kde.eclass, line 170:   Called kde_src_compile 'all'
  1812.   kde.eclass, line 340:   Called kde_src_compile 'myconf' 'configure' 'make'
  1813.   kde.eclass, line 336:   Called die
  1814.  
  1815. !!! died running emake, kde_src_compile:make
  1816. !!! If you need support, post the topmost build error, and the call stack if relevant.
  1817. !!! A complete build log is located at '/var/tmp/portage/media-gfx/digikam-0.9.2/temp/build.log'.

advertising

Update the Post

Either update this post and resubmit it with changes, or make a new post.

You may also comment on this post.

update paste below
details of the post (optional)

Note: Only the paste content is required, though the following information can be useful to others.

Save name / title?

(space separated, optional)



Please note that information posted here will not expire by default. If you do not want it to expire, please set the expiry time above. If it is set to expire, web search engines will not be allowed to index it prior to it expiring. Items that are not marked to expire will be indexable by search engines. Be careful with your passwords. All illegal activities will be reported and any information will be handed over to the authorities, so be good.

comments powered by Disqus
worth-right
worth-right