Part of Slepp's ProjectsPastebinTURLImagebinFilebin
Feedback -- English French German Japanese
Create Upload Newest Tools Donate
Sign In | Create Account

error
Monday, February 4th, 2008 at 7:33:33pm UTC 

  1. diablo@thomas-ubuntu:~/share/rbdev/rockbox6/rbutil/rbutilqt$ make
  2. make[1]: Betrete Verzeichnis '/media/SHARE/rbdev/rockbox6/tools/rbspeex'
  3. make[1]: »librbspeex.a« ist bereits aktualisiert.
  4. make[1]: Verlasse Verzeichnis '/media/SHARE/rbdev/rockbox6/tools/rbspeex'
  5. /usr/local/Trolltech/Qt-4.3.3/bin/lrelease -silent rbutilqt.pro
  6. /usr/local/Trolltech/Qt-4.3.3/bin/uic rbutilqtfrm.ui -o build/ui/ui_rbutilqtfrm.h
  7. /usr/local/Trolltech/Qt-4.3.3/bin/uic aboutbox.ui -o build/ui/ui_aboutbox.h
  8. /usr/local/Trolltech/Qt-4.3.3/bin/uic installfrm.ui -o build/ui/ui_installfrm.h
  9. /usr/local/Trolltech/Qt-4.3.3/bin/uic installprogressfrm.ui -o build/ui/ui_installprogressfrm.h
  10. /usr/local/Trolltech/Qt-4.3.3/bin/uic configurefrm.ui -o build/ui/ui_configurefrm.h
  11. /usr/local/Trolltech/Qt-4.3.3/bin/uic browsedirtreefrm.ui -o build/ui/ui_browsedirtreefrm.h
  12. /usr/local/Trolltech/Qt-4.3.3/bin/uic installtalkfrm.ui -o build/ui/ui_installtalkfrm.h
  13. /usr/local/Trolltech/Qt-4.3.3/bin/uic previewfrm.ui -o build/ui/ui_previewfrm.h
  14. /usr/local/Trolltech/Qt-4.3.3/bin/uic installthemesfrm.ui -o build/ui/ui_installthemesfrm.h
  15. /usr/local/Trolltech/Qt-4.3.3/bin/uic uninstallfrm.ui -o build/ui/ui_uninstallfrm.h
  16. /usr/local/Trolltech/Qt-4.3.3/bin/uic browseoffrm.ui -o build/ui/ui_browseoffrm.h
  17. /usr/local/Trolltech/Qt-4.3.3/bin/uic rbspeexcfgfrm.ui -o build/ui/ui_rbspeexcfgfrm.h
  18. /usr/local/Trolltech/Qt-4.3.3/bin/uic encexescfgfrm.ui -o build/ui/ui_encexescfgfrm.h
  19. /usr/local/Trolltech/Qt-4.3.3/bin/uic ttsexescfgfrm.ui -o build/ui/ui_ttsexescfgfrm.h
  20. /usr/local/Trolltech/Qt-4.3.3/bin/uic sapicfgfrm.ui -o build/ui/ui_sapicfgfrm.h
  21. /usr/local/Trolltech/Qt-4.3.3/bin/uic createvoicefrm.ui -o build/ui/ui_createvoicefrm.h
  22. g++ -c -m64 -pipe -O2 -D_REENTRANT -Wall -W -DQT_NO_DEBUG_OUTPUT -DRBUTIL -D_LARGEFILE64_SOURCE -DQT_NO_DEBUG -DQT_GUI_LIB -DQT_NETWORK_LIB -DQT_CORE_LIB -DQT_SHARED -I/usr/local/Trolltech/Qt-4.3.3/mkspecs/linux-g++-64 -I. -I/usr/local/Trolltech/Qt-4.3.3/include/QtCore -I/usr/local/Trolltech/Qt-4.3.3/include/QtCore -I/usr/local/Trolltech/Qt-4.3.3/include/QtNetwork -I/usr/local/Trolltech/Qt-4.3.3/include/QtNetwork -I/usr/local/Trolltech/Qt-4.3.3/include/QtGui -I/usr/local/Trolltech/Qt-4.3.3/include/QtGui -I/usr/local/Trolltech/Qt-4.3.3/include -I. -Iirivertools -Izip -Izlib -I../ipodpatcher -I../sansapatcher -I../../tools/rbspeex -I../../tools -Ibuild/moc -Ibuild/ui -o build/o/rbutilqt.o rbutilqt.cpp
  23. encoders.h:48: Warnung: unbenutzter Parameter »input«
  24. encoders.h:48: Warnung: unbenutzter Parameter »output«
  25. tts.h:47: Warnung: unbenutzter Parameter »text«
  26. tts.h:47: Warnung: unbenutzter Parameter »wavfile«
  27. tts.h:48: Warnung: unbenutzter Parameter »errStr«
  28. g++ -c -m64 -pipe -O2 -D_REENTRANT -Wall -W -DQT_NO_DEBUG_OUTPUT -DRBUTIL -D_LARGEFILE64_SOURCE -DQT_NO_DEBUG -DQT_GUI_LIB -DQT_NETWORK_LIB -DQT_CORE_LIB -DQT_SHARED -I/usr/local/Trolltech/Qt-4.3.3/mkspecs/linux-g++-64 -I. -I/usr/local/Trolltech/Qt-4.3.3/include/QtCore -I/usr/local/Trolltech/Qt-4.3.3/include/QtCore -I/usr/local/Trolltech/Qt-4.3.3/include/QtNetwork -I/usr/local/Trolltech/Qt-4.3.3/include/QtNetwork -I/usr/local/Trolltech/Qt-4.3.3/include/QtGui -I/usr/local/Trolltech/Qt-4.3.3/include/QtGui -I/usr/local/Trolltech/Qt-4.3.3/include -I. -Iirivertools -Izip -Izlib -I../ipodpatcher -I../sansapatcher -I../../tools/rbspeex -I../../tools -Ibuild/moc -Ibuild/ui -o build/o/main.o main.cpp
  29. g++ -c -m64 -pipe -O2 -D_REENTRANT -Wall -W -DQT_NO_DEBUG_OUTPUT -DRBUTIL -D_LARGEFILE64_SOURCE -DQT_NO_DEBUG -DQT_GUI_LIB -DQT_NETWORK_LIB -DQT_CORE_LIB -DQT_SHARED -I/usr/local/Trolltech/Qt-4.3.3/mkspecs/linux-g++-64 -I. -I/usr/local/Trolltech/Qt-4.3.3/include/QtCore -I/usr/local/Trolltech/Qt-4.3.3/include/QtCore -I/usr/local/Trolltech/Qt-4.3.3/include/QtNetwork -I/usr/local/Trolltech/Qt-4.3.3/include/QtNetwork -I/usr/local/Trolltech/Qt-4.3.3/include/QtGui -I/usr/local/Trolltech/Qt-4.3.3/include/QtGui -I/usr/local/Trolltech/Qt-4.3.3/include -I. -Iirivertools -Izip -Izlib -I../ipodpatcher -I../sansapatcher -I../../tools/rbspeex -I../../tools -Ibuild/moc -Ibuild/ui -o build/o/install.o install.cpp
  30. g++ -c -m64 -pipe -O2 -D_REENTRANT -Wall -W -DQT_NO_DEBUG_OUTPUT -DRBUTIL -D_LARGEFILE64_SOURCE -DQT_NO_DEBUG -DQT_GUI_LIB -DQT_NETWORK_LIB -DQT_CORE_LIB -DQT_SHARED -I/usr/local/Trolltech/Qt-4.3.3/mkspecs/linux-g++-64 -I. -I/usr/local/Trolltech/Qt-4.3.3/include/QtCore -I/usr/local/Trolltech/Qt-4.3.3/include/QtCore -I/usr/local/Trolltech/Qt-4.3.3/include/QtNetwork -I/usr/local/Trolltech/Qt-4.3.3/include/QtNetwork -I/usr/local/Trolltech/Qt-4.3.3/include/QtGui -I/usr/local/Trolltech/Qt-4.3.3/include/QtGui -I/usr/local/Trolltech/Qt-4.3.3/include -I. -Iirivertools -Izip -Izlib -I../ipodpatcher -I../sansapatcher -I../../tools/rbspeex -I../../tools -Ibuild/moc -Ibuild/ui -o build/o/httpget.o httpget.cpp
  31. g++ -c -m64 -pipe -O2 -D_REENTRANT -Wall -W -DQT_NO_DEBUG_OUTPUT -DRBUTIL -D_LARGEFILE64_SOURCE -DQT_NO_DEBUG -DQT_GUI_LIB -DQT_NETWORK_LIB -DQT_CORE_LIB -DQT_SHARED -I/usr/local/Trolltech/Qt-4.3.3/mkspecs/linux-g++-64 -I. -I/usr/local/Trolltech/Qt-4.3.3/include/QtCore -I/usr/local/Trolltech/Qt-4.3.3/include/QtCore -I/usr/local/Trolltech/Qt-4.3.3/include/QtNetwork -I/usr/local/Trolltech/Qt-4.3.3/include/QtNetwork -I/usr/local/Trolltech/Qt-4.3.3/include/QtGui -I/usr/local/Trolltech/Qt-4.3.3/include/QtGui -I/usr/local/Trolltech/Qt-4.3.3/include -I. -Iirivertools -Izip -Izlib -I../ipodpatcher -I../sansapatcher -I../../tools/rbspeex -I../../tools -Ibuild/moc -Ibuild/ui -o build/o/configure.o configure.cpp
  32. encoders.h:48: Warnung: unbenutzter Parameter »input«
  33. encoders.h:48: Warnung: unbenutzter Parameter »output«
  34. tts.h:47: Warnung: unbenutzter Parameter »text«
  35. tts.h:47: Warnung: unbenutzter Parameter »wavfile«
  36. tts.h:48: Warnung: unbenutzter Parameter »errStr«
  37. g++ -c -m64 -pipe -O2 -D_REENTRANT -Wall -W -DQT_NO_DEBUG_OUTPUT -DRBUTIL -D_LARGEFILE64_SOURCE -DQT_NO_DEBUG -DQT_GUI_LIB -DQT_NETWORK_LIB -DQT_CORE_LIB -DQT_SHARED -I/usr/local/Trolltech/Qt-4.3.3/mkspecs/linux-g++-64 -I. -I/usr/local/Trolltech/Qt-4.3.3/include/QtCore -I/usr/local/Trolltech/Qt-4.3.3/include/QtCore -I/usr/local/Trolltech/Qt-4.3.3/include/QtNetwork -I/usr/local/Trolltech/Qt-4.3.3/include/QtNetwork -I/usr/local/Trolltech/Qt-4.3.3/include/QtGui -I/usr/local/Trolltech/Qt-4.3.3/include/QtGui -I/usr/local/Trolltech/Qt-4.3.3/include -I. -Iirivertools -Izip -Izlib -I../ipodpatcher -I../sansapatcher -I../../tools/rbspeex -I../../tools -Ibuild/moc -Ibuild/ui -o build/o/zip.o zip/zip.cpp
  38. g++ -c -m64 -pipe -O2 -D_REENTRANT -Wall -W -DQT_NO_DEBUG_OUTPUT -DRBUTIL -D_LARGEFILE64_SOURCE -DQT_NO_DEBUG -DQT_GUI_LIB -DQT_NETWORK_LIB -DQT_CORE_LIB -DQT_SHARED -I/usr/local/Trolltech/Qt-4.3.3/mkspecs/linux-g++-64 -I. -I/usr/local/Trolltech/Qt-4.3.3/include/QtCore -I/usr/local/Trolltech/Qt-4.3.3/include/QtCore -I/usr/local/Trolltech/Qt-4.3.3/include/QtNetwork -I/usr/local/Trolltech/Qt-4.3.3/include/QtNetwork -I/usr/local/Trolltech/Qt-4.3.3/include/QtGui -I/usr/local/Trolltech/Qt-4.3.3/include/QtGui -I/usr/local/Trolltech/Qt-4.3.3/include -I. -Iirivertools -Izip -Izlib -I../ipodpatcher -I../sansapatcher -I../../tools/rbspeex -I../../tools -Ibuild/moc -Ibuild/ui -o build/o/unzip.o zip/unzip.cpp
  39. g++ -c -m64 -pipe -O2 -D_REENTRANT -Wall -W -DQT_NO_DEBUG_OUTPUT -DRBUTIL -D_LARGEFILE64_SOURCE -DQT_NO_DEBUG -DQT_GUI_LIB -DQT_NETWORK_LIB -DQT_CORE_LIB -DQT_SHARED -I/usr/local/Trolltech/Qt-4.3.3/mkspecs/linux-g++-64 -I. -I/usr/local/Trolltech/Qt-4.3.3/include/QtCore -I/usr/local/Trolltech/Qt-4.3.3/include/QtCore -I/usr/local/Trolltech/Qt-4.3.3/include/QtNetwork -I/usr/local/Trolltech/Qt-4.3.3/include/QtNetwork -I/usr/local/Trolltech/Qt-4.3.3/include/QtGui -I/usr/local/Trolltech/Qt-4.3.3/include/QtGui -I/usr/local/Trolltech/Qt-4.3.3/include -I. -Iirivertools -Izip -Izlib -I../ipodpatcher -I../sansapatcher -I../../tools/rbspeex -I../../tools -Ibuild/moc -Ibuild/ui -o build/o/installzip.o installzip.cpp
  40. g++ -c -m64 -pipe -O2 -D_REENTRANT -Wall -W -DQT_NO_DEBUG_OUTPUT -DRBUTIL -D_LARGEFILE64_SOURCE -DQT_NO_DEBUG -DQT_GUI_LIB -DQT_NETWORK_LIB -DQT_CORE_LIB -DQT_SHARED -I/usr/local/Trolltech/Qt-4.3.3/mkspecs/linux-g++-64 -I. -I/usr/local/Trolltech/Qt-4.3.3/include/QtCore -I/usr/local/Trolltech/Qt-4.3.3/include/QtCore -I/usr/local/Trolltech/Qt-4.3.3/include/QtNetwork -I/usr/local/Trolltech/Qt-4.3.3/include/QtNetwork -I/usr/local/Trolltech/Qt-4.3.3/include/QtGui -I/usr/local/Trolltech/Qt-4.3.3/include/QtGui -I/usr/local/Trolltech/Qt-4.3.3/include -I. -Iirivertools -Izip -Izlib -I../ipodpatcher -I../sansapatcher -I../../tools/rbspeex -I../../tools -Ibuild/moc -Ibuild/ui -o build/o/installbootloader.o installbootloader.cpp
  41. g++ -c -m64 -pipe -O2 -D_REENTRANT -Wall -W -DQT_NO_DEBUG_OUTPUT -DRBUTIL -D_LARGEFILE64_SOURCE -DQT_NO_DEBUG -DQT_GUI_LIB -DQT_NETWORK_LIB -DQT_CORE_LIB -DQT_SHARED -I/usr/local/Trolltech/Qt-4.3.3/mkspecs/linux-g++-64 -I. -I/usr/local/Trolltech/Qt-4.3.3/include/QtCore -I/usr/local/Trolltech/Qt-4.3.3/include/QtCore -I/usr/local/Trolltech/Qt-4.3.3/include/QtNetwork -I/usr/local/Trolltech/Qt-4.3.3/include/QtNetwork -I/usr/local/Trolltech/Qt-4.3.3/include/QtGui -I/usr/local/Trolltech/Qt-4.3.3/include/QtGui -I/usr/local/Trolltech/Qt-4.3.3/include -I. -Iirivertools -Izip -Izlib -I../ipodpatcher -I../sansapatcher -I../../tools/rbspeex -I../../tools -Ibuild/moc -Ibuild/ui -o build/o/progressloggergui.o progressloggergui.cpp
  42. g++ -c -m64 -pipe -O2 -D_REENTRANT -Wall -W -DQT_NO_DEBUG_OUTPUT -DRBUTIL -D_LARGEFILE64_SOURCE -DQT_NO_DEBUG -DQT_GUI_LIB -DQT_NETWORK_LIB -DQT_CORE_LIB -DQT_SHARED -I/usr/local/Trolltech/Qt-4.3.3/mkspecs/linux-g++-64 -I. -I/usr/local/Trolltech/Qt-4.3.3/include/QtCore -I/usr/local/Trolltech/Qt-4.3.3/include/QtCore -I/usr/local/Trolltech/Qt-4.3.3/include/QtNetwork -I/usr/local/Trolltech/Qt-4.3.3/include/QtNetwork -I/usr/local/Trolltech/Qt-4.3.3/include/QtGui -I/usr/local/Trolltech/Qt-4.3.3/include/QtGui -I/usr/local/Trolltech/Qt-4.3.3/include -I. -Iirivertools -Izip -Izlib -I../ipodpatcher -I../sansapatcher -I../../tools/rbspeex -I../../tools -Ibuild/moc -Ibuild/ui -o build/o/installtalkwindow.o installtalkwindow.cpp
  43. encoders.h:48: Warnung: unbenutzter Parameter »input«
  44. encoders.h:48: Warnung: unbenutzter Parameter »output«
  45. tts.h:47: Warnung: unbenutzter Parameter »text«
  46. tts.h:47: Warnung: unbenutzter Parameter »wavfile«
  47. tts.h:48: Warnung: unbenutzter Parameter »errStr«
  48. g++ -c -m64 -pipe -O2 -D_REENTRANT -Wall -W -DQT_NO_DEBUG_OUTPUT -DRBUTIL -D_LARGEFILE64_SOURCE -DQT_NO_DEBUG -DQT_GUI_LIB -DQT_NETWORK_LIB -DQT_CORE_LIB -DQT_SHARED -I/usr/local/Trolltech/Qt-4.3.3/mkspecs/linux-g++-64 -I. -I/usr/local/Trolltech/Qt-4.3.3/include/QtCore -I/usr/local/Trolltech/Qt-4.3.3/include/QtCore -I/usr/local/Trolltech/Qt-4.3.3/include/QtNetwork -I/usr/local/Trolltech/Qt-4.3.3/include/QtNetwork -I/usr/local/Trolltech/Qt-4.3.3/include/QtGui -I/usr/local/Trolltech/Qt-4.3.3/include/QtGui -I/usr/local/Trolltech/Qt-4.3.3/include -I. -Iirivertools -Izip -Izlib -I../ipodpatcher -I../sansapatcher -I../../tools/rbspeex -I../../tools -Ibuild/moc -Ibuild/ui -o build/o/talkfile.o talkfile.cpp
  49. encoders.h:48: Warnung: unbenutzter Parameter »input«
  50. encoders.h:48: Warnung: unbenutzter Parameter »output«
  51. tts.h:47: Warnung: unbenutzter Parameter »text«
  52. tts.h:47: Warnung: unbenutzter Parameter »wavfile«
  53. tts.h:48: Warnung: unbenutzter Parameter »errStr«
  54. g++ -c -m64 -pipe -O2 -D_REENTRANT -Wall -W -DQT_NO_DEBUG_OUTPUT -DRBUTIL -D_LARGEFILE64_SOURCE -DQT_NO_DEBUG -DQT_GUI_LIB -DQT_NETWORK_LIB -DQT_CORE_LIB -DQT_SHARED -I/usr/local/Trolltech/Qt-4.3.3/mkspecs/linux-g++-64 -I. -I/usr/local/Trolltech/Qt-4.3.3/include/QtCore -I/usr/local/Trolltech/Qt-4.3.3/include/QtCore -I/usr/local/Trolltech/Qt-4.3.3/include/QtNetwork -I/usr/local/Trolltech/Qt-4.3.3/include/QtNetwork -I/usr/local/Trolltech/Qt-4.3.3/include/QtGui -I/usr/local/Trolltech/Qt-4.3.3/include/QtGui -I/usr/local/Trolltech/Qt-4.3.3/include -I. -Iirivertools -Izip -Izlib -I../ipodpatcher -I../sansapatcher -I../../tools/rbspeex -I../../tools -Ibuild/moc -Ibuild/ui -o build/o/autodetection.o autodetection.cpp
  55. autodetection.cpp:24:17: Fehler: usb.h: No such file or directory
  56. autodetection.cpp: In member function »bool Autodetection::detectUsb()«:
  57. autodetection.cpp:277: Fehler: »usb_init« wurde in diesem Gültigkeitsbereich nicht definiert
  58. autodetection.cpp:278: Fehler: »usb_find_busses« wurde in diesem Gültigkeitsbereich nicht definiert
  59. autodetection.cpp:279: Fehler: »usb_find_devices« wurde in diesem Gültigkeitsbereich nicht definiert
  60. autodetection.cpp:281: Fehler: »usb_get_busses« wurde in diesem Gültigkeitsbereich nicht definiert
  61. autodetection.cpp:284: Fehler: invalid use of undefined type »struct usb_bus«
  62. autodetection.cpp:280: Fehler: forward declaration of »struct usb_bus«
  63. autodetection.cpp:284: Fehler: invalid use of undefined type »struct usb_bus«
  64. autodetection.cpp:280: Fehler: forward declaration of »struct usb_bus«
  65. autodetection.cpp:285: Fehler: invalid use of undefined type »struct usb_bus«
  66. autodetection.cpp:280: Fehler: forward declaration of »struct usb_bus«
  67. autodetection.cpp:288: Fehler: invalid use of undefined type »struct usb_bus«
  68. autodetection.cpp:280: Fehler: forward declaration of »struct usb_bus«
  69. autodetection.cpp:291: Fehler: invalid use of undefined type »struct usb_device«
  70. autodetection.cpp:287: Fehler: forward declaration of »struct usb_device«
  71. autodetection.cpp:291: Fehler: invalid use of undefined type »struct usb_device«
  72. autodetection.cpp:287: Fehler: forward declaration of »struct usb_device«
  73. autodetection.cpp:305: Fehler: invalid use of undefined type »struct usb_device«
  74. autodetection.cpp:287: Fehler: forward declaration of »struct usb_device«
  75. autodetection.cpp:308: Fehler: invalid use of undefined type »struct usb_bus«
  76. autodetection.cpp:280: Fehler: forward declaration of »struct usb_bus«
  77. make: *** [build/o/autodetection.o] Fehler 1
  78. diablo@thomas-ubuntu:~/share/rbdev/rockbox6/rbutil/rbutilqt$ cd
  79. diablo@thomas-ubuntu:~$ cd .wine/drive_c/Programme/Xfire/
  80. diablo@thomas-ubuntu:~/.wine/drive_c/Programme/Xfire$ WINEDEBUG=-all wine xfire.exe
  81. diablo@thomas-ubuntu:~/.wine/drive_c/Programme/Xfire$ cd /media/
  82. cdrom/   cdrom0/  cdrom1/  floppy/  floppy0/ sda1/    sda5/    SHARE/
  83. diablo@thomas-ubuntu:~/.wine/drive_c/Programme/Xfire$ cd /media/sda1/S
  84. Spiele/                    System Volume Information/
  85. diablo@thomas-ubuntu:~/.wine/drive_c/Programme/Xfire$ cd /media/sda1/S
  86. Spiele/                    System Volume Information/
  87. diablo@thomas-ubuntu:~/.wine/drive_c/Programme/Xfire$ cd /media/sda1/Spiele/Valve/
  88. diablo@thomas-ubuntu:/media/sda1/Spiele/Valve$ WINEDEBUG=-all wine steam.exe -applaunch 240 -novid -dxlevel 90 -width 1024 -height 768
  89. diablo@thomas-ubuntu:/media/sda1/Spiele/Valve$ cd
  90. diablo@thomas-ubuntu:~$ cd share/rbdev/rockbox6/rbutil/rbutilqt/
  91. diablo@thomas-ubuntu:~/share/rbdev/rockbox6/rbutil/rbutilqt$ qmake
  92. Project MESSAGE: release
  93. diablo@thomas-ubuntu:~/share/rbdev/rockbox6/rbutil/rbutilqt$ make
  94. make[1]: Betrete Verzeichnis '/media/SHARE/rbdev/rockbox6/tools/rbspeex'
  95. make[1]: »librbspeex.a« ist bereits aktualisiert.
  96. make[1]: Verlasse Verzeichnis '/media/SHARE/rbdev/rockbox6/tools/rbspeex'
  97. /usr/local/Trolltech/Qt-4.3.3/bin/lrelease -silent rbutilqt.pro
  98. g++ -c -m64 -pipe -O2 -D_REENTRANT -Wall -W -DQT_NO_DEBUG_OUTPUT -DRBUTIL -D_LARGEFILE64_SOURCE -DQT_NO_DEBUG -DQT_GUI_LIB -DQT_NETWORK_LIB -DQT_CORE_LIB -DQT_SHARED -I/usr/local/Trolltech/Qt-4.3.3/mkspecs/linux-g++-64 -I. -I/usr/local/Trolltech/Qt-4.3.3/include/QtCore -I/usr/local/Trolltech/Qt-4.3.3/include/QtCore -I/usr/local/Trolltech/Qt-4.3.3/include/QtNetwork -I/usr/local/Trolltech/Qt-4.3.3/include/QtNetwork -I/usr/local/Trolltech/Qt-4.3.3/include/QtGui -I/usr/local/Trolltech/Qt-4.3.3/include/QtGui -I/usr/local/Trolltech/Qt-4.3.3/include -I. -Iirivertools -Izip -Izlib -I../ipodpatcher -I../sansapatcher -I../../tools/rbspeex -I../../tools -Ibuild/moc -Ibuild/ui -o build/o/autodetection.o autodetection.cpp
  99. autodetection.cpp:24:17: Fehler: usb.h: No such file or directory
  100. autodetection.cpp: In member function »bool Autodetection::detectUsb()«:
  101. autodetection.cpp:277: Fehler: »usb_init« wurde in diesem Gültigkeitsbereich nicht definiert
  102. autodetection.cpp:278: Fehler: »usb_find_busses« wurde in diesem Gültigkeitsbereich nicht definiert
  103. autodetection.cpp:279: Fehler: »usb_find_devices« wurde in diesem Gültigkeitsbereich nicht definiert
  104. autodetection.cpp:281: Fehler: »usb_get_busses« wurde in diesem Gültigkeitsbereich nicht definiert
  105. autodetection.cpp:284: Fehler: invalid use of undefined type »struct usb_bus«
  106. autodetection.cpp:280: Fehler: forward declaration of »struct usb_bus«
  107. autodetection.cpp:284: Fehler: invalid use of undefined type »struct usb_bus«
  108. autodetection.cpp:280: Fehler: forward declaration of »struct usb_bus«
  109. autodetection.cpp:285: Fehler: invalid use of undefined type »struct usb_bus«
  110. autodetection.cpp:280: Fehler: forward declaration of »struct usb_bus«
  111. autodetection.cpp:288: Fehler: invalid use of undefined type »struct usb_bus«
  112. autodetection.cpp:280: Fehler: forward declaration of »struct usb_bus«
  113. autodetection.cpp:291: Fehler: invalid use of undefined type »struct usb_device«
  114. autodetection.cpp:287: Fehler: forward declaration of »struct usb_device«
  115. autodetection.cpp:291: Fehler: invalid use of undefined type »struct usb_device«
  116. autodetection.cpp:287: Fehler: forward declaration of »struct usb_device«
  117. autodetection.cpp:305: Fehler: invalid use of undefined type »struct usb_device«
  118. autodetection.cpp:287: Fehler: forward declaration of »struct usb_device«
  119. autodetection.cpp:308: Fehler: invalid use of undefined type »struct usb_bus«
  120. autodetection.cpp:280: Fehler: forward declaration of »struct usb_bus«
  121. make: *** [build/o/autodetection.o] Fehler 1
  122. diablo@thomas-ubuntu:~/share/rbdev/rockbox6/rbutil/rbutilqt$ make >> log.txt
  123. autodetection.cpp:24:17: Fehler: usb.h: No such file or directory
  124. autodetection.cpp: In member function »bool Autodetection::detectUsb()«:
  125. autodetection.cpp:277: Fehler: »usb_init« wurde in diesem Gültigkeitsbereich nicht definiert
  126. autodetection.cpp:278: Fehler: »usb_find_busses« wurde in diesem Gültigkeitsbereich nicht definiert
  127. autodetection.cpp:279: Fehler: »usb_find_devices« wurde in diesem Gültigkeitsbereich nicht definiert
  128. autodetection.cpp:281: Fehler: »usb_get_busses« wurde in diesem Gültigkeitsbereich nicht definiert
  129. autodetection.cpp:284: Fehler: invalid use of undefined type »struct usb_bus«
  130. autodetection.cpp:280: Fehler: forward declaration of »struct usb_bus«
  131. autodetection.cpp:284: Fehler: invalid use of undefined type »struct usb_bus«
  132. autodetection.cpp:280: Fehler: forward declaration of »struct usb_bus«
  133. autodetection.cpp:285: Fehler: invalid use of undefined type »struct usb_bus«
  134. autodetection.cpp:280: Fehler: forward declaration of »struct usb_bus«
  135. autodetection.cpp:288: Fehler: invalid use of undefined type »struct usb_bus«
  136. autodetection.cpp:280: Fehler: forward declaration of »struct usb_bus«
  137. autodetection.cpp:291: Fehler: invalid use of undefined type »struct usb_device«
  138. autodetection.cpp:287: Fehler: forward declaration of »struct usb_device«
  139. autodetection.cpp:291: Fehler: invalid use of undefined type »struct usb_device«
  140. autodetection.cpp:287: Fehler: forward declaration of »struct usb_device«
  141. autodetection.cpp:305: Fehler: invalid use of undefined type »struct usb_device«
  142. autodetection.cpp:287: Fehler: forward declaration of »struct usb_device«
  143. autodetection.cpp:308: Fehler: invalid use of undefined type »struct usb_bus«
  144. autodetection.cpp:280: Fehler: forward declaration of »struct usb_bus«
  145. make: *** [build/o/autodetection.o] Fehler 1

Update the Post

Either update this post and resubmit it with changes, or make a new post.

You may also comment on this post.

update paste below
details of the post (optional)

Note: Only the paste content is required, though the following information can be useful to others.

Save name / title?

(space separated, optional)



Please note that information posted here will expire by default in one month. If you do not want it to expire, please set the expiry time above. If it is set to expire, web search engines will not be allowed to index it prior to it expiring. Items that are not marked to expire will be indexable by search engines. Be careful with your passwords. All illegal activities will be reported and any information will be handed over to the authorities, so be good.

comments powered by Disqus
worth-right
worth-right