All pastes #78514 Raw Edit

Anonymous

public text v1 · immutable
#78514 ·published 2006-07-04 05:02 UTC
rendered paste body
[dk@lqt misc]$ darcs get --partial http://iki.fi/tuomov/repos/ion-3/
Directory '/home/dk/misc/ion-3' already exists, creating repository as '/home/dk/misc/ion-3_0'
Copying patch 71 of 71... done!
Applying patch 70 of 70... done.
Finished getting.

[dk@lqt misc]$ cd ion-3
[dk@lqt ion-3]$ sh predist.sh -snapshot

darcs failed:  Directory or file named 'libtu.tmp' already exists.
[dk@lqt ion-3]$

[dk@lqt ion-3]$ make
set -e; for i in libmainloop mod_ionws mod_floatws mod_query mod_menu mod_dock mod_sp mod_sm mod_panews de mod_mgmtmode mod_statusbar ioncore ion pwm etc utils man po ; do make -C $i; done
make[1]: Entering directory `/home/dk/misc/ion-3/libmainloop'
gcc -g -Os -W -Wimplicit -Wreturn-type -Wswitch -Wcomment -Wtrigraphs -Wformat -Wchar-subscripts -Wparentheses -pedantic -Wuninitialized -DCF_XINERAMA -DCF_XFREE86_TEXTPROP_BUG_WORKAROUND    -I..   -c select.c -o select.o
select.c:12:25: error: libtu/types.h: No such file or directory
select.c:13:24: error: libtu/misc.h: No such file or directory
select.c:14:25: error: libtu/dlist.h: No such file or directory
In file included from select.c:16:
select.h:18:23: error: libtu/obj.h: No such file or directory
In file included from select.c:16:
select.h:21: warning: data definition has no type or storage class
select.h:21: warning: type defaults to 'int' in declaration of 'INTRSTRUCT'
select.h:21: warning: parameter names (without types) in function declaration
select.h:23: warning: return type defaults to 'int'
select.h: In function 'DECLSTRUCT':
select.h:23: warning: type of 'WInputFd' defaults to 'int'
select.h:27: error: 'next' undeclared (first use in this function)
select.h:27: error: (Each undeclared identifier is reported only once
select.h:27: error: for each function it appears in.)
select.h:27: error: 'prev' undeclared (first use in this function)
select.h:27: warning: left-hand operand of comma expression has no effect
select.h:27: warning: statement with no effect
select.h: At top level:
select.h:28: warning: ISO C does not allow extra ';' outside of a function
select.h:30: error: expected '=', ',', ';', 'asm' or '__attribute__' before 'mainloop_register_input_fd'
select.c:22: error: expected '=', ',', ';', 'asm' or '__attribute__' before '*' token
select.c:24: error: expected '=', ',', ';', 'asm' or '__attribute__' before '*' token
select.c:36: error: expected '=', ',', ';', 'asm' or '__attribute__' before 'mainloop_register_input_fd'
select.c: In function 'mainloop_unregister_input_fd':
select.c:59: error: 'WInputFd' undeclared (first use in this function)
select.c:59: error: 'tmp' undeclared (first use in this function)
select.c:59: warning: implicit declaration of function 'find_input_fd'
select.c:62: warning: implicit declaration of function 'UNLINK_ITEM'
select.c:62: error: 'input_fds' undeclared (first use in this function)
select.c:62: error: 'next' undeclared (first use in this function)
select.c:62: error: 'prev' undeclared (first use in this function)
select.c: In function 'set_input_fds':
select.c:69: error: 'WInputFd' undeclared (first use in this function)
select.c:69: error: 'tmp' undeclared (first use in this function)
select.c:69: error: 'input_fds' undeclared (first use in this function)
select.c:72: error: invalid lvalue in asm output 0
select.c: In function 'check_input_fds':
select.c:81: error: 'WInputFd' undeclared (first use in this function)
select.c:81: error: 'tmp' undeclared (first use in this function)
select.c:81: error: 'input_fds' undeclared (first use in this function)
select.c:81: error: 'next' undeclared (first use in this function)
select.c:81: warning: left-hand operand of comma expression has no effect
select.c:81: warning: statement with no effect
select.c:85: error: memory input 2 is not directly addressable
select.c: In function 'DECLSTRUCT':
select.h:28: warning: control reaches end of non-void function
make[1]: *** [select.o] Error 1
make[1]: Leaving directory `/home/dk/misc/ion-3/libmainloop'
make: *** [subdirs] Error 2