| ccache gcc -DHAVE_CONFIG_H -I. -I. -I.. -I/usr/local/oe/tmp/staging/i686-linux/include/freetype2 -I/usr/local/oe/tmp/staging/i686-linux/include -Wall -Wpointer-arith -Wstrict-prototypes -Wmissing-prototypes -Wmissing-declarations -Wnested-externs -fno-strict-aliasing -DFONTCONFIG_PATH=\"/usr/local/oe/tmp/staging/etc/fonts\" -I.. -I../src -isystem/usr/local/oe/tmp/staging/i686-linux/include -isystem/usr/local/oe/tmp/staging/i686-linux/include -O2 -MT fcfreetype.lo -MD -MP -MF .deps/fcfreetype.Tpo -c fcfreetype.c -fPIC -DPIC -o .libs/fcfreetype.o
| fcfreetype.c:53:10: error: #include expects "FILENAME" or <FILENAME>
| fcfreetype.c:58:10: error: #include expects "FILENAME" or <FILENAME>
| fcfreetype.c:59:10: error: #include expects "FILENAME" or <FILENAME>
| fcfreetype.c:60:10: error: #include expects "FILENAME" or <FILENAME>
| fcfreetype.c: In function 'FcGetPixelSize':
| fcfreetype.c:965: error: dereferencing pointer to incomplete type
| fcfreetype.c: In function 'FcFreeTypeQuery':
| fcfreetype.c:1442: error: dereferencing pointer to incomplete type
| fcfreetype.c:1449: error: dereferencing pointer to incomplete type
| fcfreetype.c:1472: error: dereferencing pointer to incomplete type
| fcfreetype.c:1552: error: dereferencing pointer to incomplete type
| fcfreetype.c:1569: warning: implicit declaration of function 'FT_MODULE_CLASS'
| fcfreetype.c:1569: warning: nested extern declaration of 'FT_MODULE_CLASS'
| fcfreetype.c:1569: error: dereferencing pointer to incomplete type
| fcfreetype.c:1569: error: invalid type argument of '->'
| fcfreetype.c:1569: error: dereferencing pointer to incomplete type
| fcfreetype.c:1569: error: invalid type argument of '->'
| fcfreetype.c:1569: error: dereferencing pointer to incomplete type
| fcfreetype.c:1569: error: invalid type argument of '->'
| fcfreetype.c:1569: error: dereferencing pointer to incomplete type
| fcfreetype.c:1569: error: invalid type argument of '->'
| fcfreetype.c:1569: error: dereferencing pointer to incomplete type
| fcfreetype.c:1569: error: invalid type argument of '->'
| fcfreetype.c:1569: error: dereferencing pointer to incomplete type
| fcfreetype.c:1569: error: invalid type argument of '->'
| fcfreetype.c:1569: error: dereferencing pointer to incomplete type
| fcfreetype.c:1569: error: invalid type argument of '->'
| fcfreetype.c:1569: error: dereferencing pointer to incomplete type
| fcfreetype.c:1569: error: invalid type argument of '->'
| fcfreetype.c:1569: error: dereferencing pointer to incomplete type
| fcfreetype.c:1569: error: invalid type argument of '->'
| fcfreetype.c:1569: error: dereferencing pointer to incomplete type
| fcfreetype.c:1569: error: invalid type argument of '->'
| fcfreetype.c:1569: error: dereferencing pointer to incomplete type
| fcfreetype.c:1569: error: invalid type argument of '->'
| fcfreetype.c:1569: error: dereferencing pointer to incomplete type
| fcfreetype.c:1569: error: invalid type argument of '->'
| fcfreetype.c:1569: error: dereferencing pointer to incomplete type
| fcfreetype.c:1569: error: invalid type argument of '->'
| fcfreetype.c:1569: error: dereferencing pointer to incomplete type
| fcfreetype.c:1569: error: invalid type argument of '->'
| fcfreetype.c:1569: error: dereferencing pointer to incomplete type
| fcfreetype.c:1569: error: invalid type argument of '->'
| fcfreetype.c:1569: error: dereferencing pointer to incomplete type
| fcfreetype.c:1569: error: invalid type argument of '->'
| fcfreetype.c:1569: error: dereferencing pointer to incomplete type
| fcfreetype.c:1569: error: invalid type argument of '->'
| fcfreetype.c:1569: error: dereferencing pointer to incomplete type
| fcfreetype.c:1569: error: invalid type argument of '->'
| fcfreetype.c:1569: error: dereferencing pointer to incomplete type
| fcfreetype.c:1569: error: invalid type argument of '->'
| fcfreetype.c:1569: error: dereferencing pointer to incomplete type
| fcfreetype.c:1569: error: invalid type argument of '->'
| fcfreetype.c:1606: error: dereferencing pointer to incomplete type
| fcfreetype.c:1616: error: dereferencing pointer to incomplete type
| fcfreetype.c: In function 'GetScriptTags':
| fcfreetype.c:2734: error: 'TT_Face' undeclared (first use in this function)
| fcfreetype.c:2734: error: (Each undeclared identifier is reported only once
| fcfreetype.c:2734: error: for each function it appears in.)
| fcfreetype.c:2734: error: expected ';' before 'tt_face'
| fcfreetype.c:2743: error: 'tt_face' undeclared (first use in this function)
| fcfreetype.c:2746: warning: implicit declaration of function 'FT_STREAM_POS'
| fcfreetype.c:2746: warning: nested extern declaration of 'FT_STREAM_POS'
| fcfreetype.c:2750: warning: implicit declaration of function 'FT_STREAM_SEEK'
| fcfreetype.c:2750: warning: nested extern declaration of 'FT_STREAM_SEEK'
| fcfreetype.c:2750: warning: implicit declaration of function 'FT_FRAME_ENTER'
| fcfreetype.c:2750: warning: nested extern declaration of 'FT_FRAME_ENTER'
| fcfreetype.c:2753: warning: implicit declaration of function 'FT_GET_USHORT'
| fcfreetype.c:2753: warning: nested extern declaration of 'FT_GET_USHORT'
| fcfreetype.c:2755: warning: implicit declaration of function 'FT_FRAME_EXIT'
| fcfreetype.c:2755: warning: nested extern declaration of 'FT_FRAME_EXIT'
| fcfreetype.c:2771: warning: implicit declaration of function 'FT_SET_ERROR'
| fcfreetype.c:2771: warning: nested extern declaration of 'FT_SET_ERROR'
| fcfreetype.c:2771: warning: implicit declaration of function 'FT_MEM_ALLOC_ARRAY'
| fcfreetype.c:2771: warning: nested extern declaration of 'FT_MEM_ALLOC_ARRAY'
| fcfreetype.c:2771: error: expected expression before 'FT_ULong'
| fcfreetype.c:2780: warning: implicit declaration of function 'FT_GET_ULONG'
| fcfreetype.c:2780: warning: nested extern declaration of 'FT_GET_ULONG'
| fcfreetype.c:2811: warning: implicit declaration of function 'FT_FREE'
| fcfreetype.c:2811: warning: nested extern declaration of 'FT_FREE'
| fcfreetype.c:2738: warning: unused variable 'memory'
| fcfreetype.c: In function 'FcFontCapabilities':
| fcfreetype.c:2824: warning: unused variable 'memory'
| make[2]: *** [fcfreetype.lo] Error 1
| make[2]: Leaving directory `/usr/local/oe/tmp/work/i686-linux/fontconfig-native-2.3.91-r3/fontconfig-2.3.91/src'
| make[1]: *** [all-recursive] Error 1
| make[1]: Leaving directory `/usr/local/oe/tmp/work/i686-linux/fontconfig-native-2.3.91-r3/fontconfig-2.3.91'
| make: *** [all] Error 2
| FATAL: oe_runmake failed
NOTE: Task failed: /usr/local/oe/tmp/work/i686-linux/fontconfig-native-2.3.91-r3/temp/log.do_compile.9185
NOTE: package fontconfig-native-2.3.91-r3: task do_compile: failed
ERROR: TaskFailed event exception, aborting
NOTE: package fontconfig-native-2.3.91: failed
ERROR: Build of /opt/oe/org.openembedded.dev/packages/fontconfig/fontconfig-native_2.3.91.bb do_compile failed
ERROR: Task 22 (/opt/oe/org.openembedded.dev/packages/fontconfig/fontconfig-native_2.3.91.bb, do_compile) failed
NOTE: Tasks Summary: Attempted 242 tasks of which 238 didn't need to be rerun and 1 failed.
ERROR: '/opt/oe/org.openembedded.dev/packages/fontconfig/fontconfig-native_2.3.91.bb' failed